program: Orca
programVersion: 5.0.2
elementType: O O O N C C C C C C C C C C C C C C C C C C C C C C H H H H H H H H H H H H H H H H H H H H H H H
charge: 0
multiplicity: 1
keywords: wb97x-d3
keywords: def2-TZVPP
keywords: def2/J RIJCOSX
keywords: DEFGRID2
keywords: scfconv7
keywords: smallprint printgap noloewdin
keywords: NOSOSCF
formula: C22H23NO3
InChI: InChI=1/C22H23NO3/c1-21(2)19(22(21,3)4)20(24)26-18(14-23)15-9-8-12-17(13-15)25-16-10-6-5-7-11-16/h5-13,18-19H,1-4H3
49 atoms
O  0.729912 1.729513 -0.043142
O  1.483223 2.892192 -1.789457
O  -2.821573 -2.710772 -0.646719
N  -1.841787 3.762597 -0.91168
C  4.285368 2.095998 -0.468421
C  4.015979 3.512016 -0.073984
C  2.914938 2.473368 0.106478
C  4.421396 1.709317 -1.92247
C  5.138639 1.210173 0.411681
C  4.600234 4.059207 1.211212
C  3.913885 4.602031 -1.11639
C  1.691898 2.420683 -0.697438
C  -0.492913 1.524922 -0.733032
C  -1.29824 0.503498 0.027885
C  -1.231319 2.790482 -0.830034
C  -1.685398 -0.65907 -0.620595
C  -1.631185 0.711234 1.361804
C  -2.420358 -1.615101 0.066734
C  -2.36091 -0.255113 2.035309
C  -2.763918 -1.420029 1.397092
C  -2.834386 -3.949976 -0.052664
C  -1.801765 -4.383227 0.769624
C  -3.898385 -4.785234 -0.359118
C  -1.850776 -5.666556 1.294808
C  -3.927599 -6.070249 0.164455
C  -2.910184 -6.514131 0.997743
H  2.761777 2.143967 1.128274
H  5.460943 1.829242 -2.233844
H  4.161303 0.657769 -2.056365
H  3.809415 2.286061 -2.609435
H  4.915517 0.159638 0.217736
H  6.197307 1.366382 0.194308
H  4.988051 1.3823 1.475277
H  5.641693 4.351475 1.062408
H  4.050773 4.949989 1.521173
H  4.566832 3.354604 2.039809
H  3.609311 4.268562 -2.102832
H  3.211948 5.373514 -0.79518
H  4.890184 5.07866 -1.224314
H  -0.315444 1.16965 -1.752595
H  -1.420674 -0.825604 -1.657749
H  -1.332132 1.617595 1.873035
H  -2.630465 -0.100418 3.071294
H  -3.344209 -2.15824 1.935439
H  -0.96415 -3.73616 0.997437
H  -4.69292 -4.433969 -1.005154
H  -1.047807 -6.005122 1.936352
H  -4.7569 -6.722329 -0.07607
H  -2.939439 -7.513798 1.409947
elementType: O N C H
totalener: -1132.68533839 hartree
nucrepener: 2152.69472471 hartree
electener: -3285.38006309 hartree
oneelecener: -5814.23039671 hartree
twoeener: 2528.85033361 hartree
cpcmener: -0.03583641 hartree
kineticenergy: 1127.64968364 hartree
xcener: -110.657633242148 hartree
chargesum: 0.0000000
charge: -0.291939 -0.479585 -0.339130 -0.104681 0.096436 0.108589 -0.118425 -0.299891 -0.282133 -0.286398 -0.304901 0.402639 0.441862 -0.003674 -0.234171 -0.202591 -0.222124 0.239496 -0.151661 -0.161064 0.277088 -0.183717 -0.247481 -0.151755 -0.127970 -0.184683 0.090199 0.103621 0.102073 0.096147 0.096255 0.100038 0.092799 0.099317 0.096268 0.093800 0.096413 0.102403 0.098448 0.126682 0.140554 0.154641 0.164141 0.162107 0.160021 0.149462 0.163395 0.161492 0.161591
qa: -0.2919 -0.4796 -0.3391 -0.1047 0.0964 0.1086 -0.1184 -0.2999 -0.2821 -0.2864 -0.3049 0.4026 0.4419 -0.0037 -0.2342 -0.2026 -0.2221 0.2395 -0.1517 -0.1611 0.2771 -0.1837 -0.2475 -0.1518 -0.1280 -0.1847 0.0902 0.1036 0.1021 0.0961 0.0963 0.1000 0.0928 0.0993 0.0963 0.0938 0.0964 0.1024 0.0984 0.1267 0.1406 0.1546 0.1641 0.1621 0.1600 0.1495 0.1634 0.1615 0.1616
va: 2.1552 2.0184 2.0595 3.1101 3.7209 3.6880 3.9389 3.9113 3.9036 3.9070 3.9037 4.0832 3.6962 3.7389 4.0244 4.0381 3.9830 3.7830 3.9219 3.9101 3.6800 3.8999 4.0022 3.8878 3.8820 3.8944 1.0289 0.9977 0.9998 1.0124 1.0026 0.9987 1.0052 0.9986 1.0019 1.0050 1.0110 0.9994 0.9985 1.0246 1.0156 1.0081 0.9900 0.9931 0.9956 1.0067 0.9890 0.9880 0.9892
dispcorr: -0.022594481 hartree
energy: -1132.707932870351
dipole: 32.76874 -31.14543 1.62331 8.06198 -10.38932 -2.32735 3.92837 -2.24948 1.67889
magnitude: 3.29702 au
magnitude: 8.38036 debye
