program: Orca
programVersion: 5.0.2
elementType: O O O N C C C C C C C C C C C C C C C C C C C C C C H H H H H H H H H H H H H H H H H H H H H H H
charge: 0
multiplicity: 1
keywords: wb97x-d3
keywords: def2-TZVPP
keywords: def2/J RIJCOSX
keywords: DEFGRID2
keywords: scfconv7
keywords: smallprint printgap noloewdin
keywords: NOSOSCF
formula: C22H23NO3
InChI: InChI=1/C22H23NO3/c1-21(2)19(22(21,3)4)20(24)26-18(14-23)15-9-8-12-17(13-15)25-16-10-6-5-7-11-16/h5-13,18-19H,1-4H3
49 atoms
O  0.609726 1.70016 -0.048836
O  1.186084 3.331053 -1.471226
O  -2.039846 -2.336567 1.530115
N  -1.481123 3.390349 1.9206
C  4.038275 1.983761 -1.351291
C  4.054809 2.985105 -0.24373
C  2.872941 2.01895 -0.361478
C  3.848621 2.413983 -2.787332
C  4.91434 0.752616 -1.268963
C  4.943012 2.76838 0.962392
C  3.889491 4.46085 -0.524519
C  1.519942 2.451718 -0.71639
C  -0.766304 2.01711 -0.190522
C  -1.576802 0.750376 -0.298158
C  -1.163405 2.790299 0.991747
C  -1.434855 -0.254736 0.650836
C  -2.461815 0.600478 -1.355839
C  -2.191818 -1.410919 0.536557
C  -3.218035 -0.559116 -1.452335
C  -3.093848 -1.567716 -0.511355
C  -2.259295 -3.669971 1.273577
C  -1.688623 -4.305699 0.178222
C  -3.023012 -4.376818 2.189459
C  -1.900397 -5.665172 0.001742
C  -3.21565 -5.739532 2.007218
C  -2.662355 -6.387145 0.911607
H  2.882066 1.214561 0.365226
H  3.372397 1.616861 -3.360845
H  3.255964 3.312978 -2.921916
H  4.825667 2.598039 -3.238272
H  5.929255 0.985289 -1.597444
H  4.976313 0.331263 -0.267782
H  4.527327 -0.028154 -1.926072
H  5.960593 3.102659 0.75046
H  4.5752 3.353395 1.807281
H  4.993109 1.730603 1.285399
H  3.414201 4.958464 0.322564
H  4.876443 4.910217 -0.650581
H  3.311934 4.699431 -1.411573
H  -0.948505 2.64143 -1.068578
H  -0.748621 -0.146186 1.482561
H  -2.563056 1.382468 -2.097173
H  -3.917072 -0.679552 -2.268849
H  -3.700219 -2.459753 -0.597456
H  -1.084473 -3.752844 -0.530166
H  -3.456824 -3.866855 3.040099
H  -1.461037 -6.162064 -0.853139
H  -3.807372 -6.292608 2.724666
H  -2.820069 -7.447721 0.768552
elementType: O N C H
totalener: -1132.68401350 hartree
nucrepener: 2162.53793503 hartree
electener: -3295.22194853 hartree
oneelecener: -5834.02080680 hartree
twoeener: 2538.79885826 hartree
cpcmener: -0.03306979 hartree
kineticenergy: 1127.64809634 hartree
xcener: -110.657389882590 hartree
chargesum: -0.0000000
charge: -0.300193 -0.479882 -0.336164 -0.104401 0.105756 0.103964 -0.143364 -0.303894 -0.282367 -0.283087 -0.303582 0.419892 0.438148 0.000673 -0.224975 -0.257090 -0.179693 0.267826 -0.139114 -0.185078 0.275487 -0.192864 -0.239418 -0.147160 -0.129874 -0.180555 0.089661 0.102091 0.096875 0.100184 0.099457 0.093238 0.095821 0.099015 0.095908 0.093351 0.102219 0.099997 0.097038 0.123546 0.140449 0.151616 0.164350 0.159348 0.161769 0.149120 0.162814 0.161363 0.161780
qa: -0.3002 -0.4799 -0.3362 -0.1044 0.1058 0.1040 -0.1434 -0.3039 -0.2824 -0.2831 -0.3036 0.4199 0.4381 0.0007 -0.2250 -0.2571 -0.1797 0.2678 -0.1391 -0.1851 0.2755 -0.1929 -0.2394 -0.1472 -0.1299 -0.1806 0.0897 0.1021 0.0969 0.1002 0.0995 0.0932 0.0958 0.0990 0.0959 0.0934 0.1022 0.1000 0.0970 0.1235 0.1404 0.1516 0.1643 0.1593 0.1618 0.1491 0.1628 0.1614 0.1618
va: 2.1367 2.0243 2.0660 3.1111 3.6906 3.6918 3.9269 3.9108 3.9065 3.9075 3.9093 4.0943 3.6686 3.7639 4.0839 4.0845 3.9338 3.7739 3.9094 3.9069 3.6762 3.9187 4.0056 3.8840 3.8797 3.8934 1.0297 0.9989 1.0123 0.9980 0.9989 1.0051 1.0024 0.9989 1.0023 1.0052 0.9989 0.9983 1.0121 1.0432 1.0256 0.9991 0.9899 0.9953 0.9943 1.0065 0.9891 0.9882 0.9891
dispcorr: -0.022524680 hartree
energy: -1132.706538183141
dipole: 30.31082 -29.42878 0.88203 5.61236 -7.77052 -2.15816 -9.62505 8.13177 -1.49329
magnitude: 2.76867 au
magnitude: 7.03741 debye
