program: Orca
programVersion: 5.0.2
elementType: O O O N C C C C C C C C C C C C C C C C C C C C C C H H H H H H H H H H H H H H H H H H H H H H H
charge: 0
multiplicity: 1
keywords: wb97x-d3
keywords: def2-TZVPP
keywords: def2/J RIJCOSX
keywords: DEFGRID2
keywords: scfconv7
keywords: smallprint printgap noloewdin
keywords: NOSOSCF
formula: C22H23NO3
InChI: InChI=1/C22H23NO3/c1-21(2)19(22(21,3)4)20(24)26-18(14-23)15-9-8-12-17(13-15)25-16-10-6-5-7-11-16/h5-13,18-19H,1-4H3
49 atoms
O  0.032818 2.422026 -1.360029
O  0.5491 2.710463 0.789875
O  -0.531301 -2.323286 -0.135758
N  -2.173871 4.57401 0.089207
C  3.557005 2.519036 -0.068861
C  3.121916 1.096376 -0.226651
C  2.273662 2.228278 -0.828325
C  3.543998 3.189113 1.28633
C  4.69256 3.049533 -0.918393
C  3.80649 0.189795 -1.224303
C  2.611015 0.308472 0.957572
C  0.92089 2.487741 -0.335624
C  -1.337271 2.356178 -1.018005
C  -1.679314 1.108234 -0.226105
C  -1.780594 3.590185 -0.358551
C  -1.00283 -0.066407 -0.532549
C  -2.672419 1.10396 0.743084
C  -1.295964 -1.229813 0.161904
C  -2.968533 -0.074667 1.414041
C  -2.281987 -1.246197 1.140883
C  -1.085141 -3.579582 -0.050065
C  -0.38411 -4.547684 0.651224
C  -2.276358 -3.885534 -0.695294
C  -0.88096 -5.843487 0.700841
C  -2.766251 -5.181449 -0.628636
C  -2.073021 -6.1641 0.066871
H  2.350752 2.304829 -1.907358
H  2.823824 2.786542 1.990983
H  4.531762 3.088296 1.740421
H  3.344327 4.256879 1.182004
H  4.656791 4.139981 -0.951007
H  5.655812 2.765075 -0.490354
H  4.666415 2.695278 -1.946976
H  4.708946 -0.24294 -0.787242
H  3.146096 -0.635866 -1.495427
H  4.090551 0.693171 -2.145865
H  3.453824 -0.158134 1.471409
H  2.066253 0.890773 1.694966
H  1.951335 -0.494443 0.621638
H  -1.858956 2.324839 -1.978751
H  -0.237968 -0.094637 -1.298954
H  -3.21542 2.006373 0.991824
H  -3.736158 -0.075881 2.176167
H  -2.51026 -2.149458 1.69148
H  0.542816 -4.29165 1.148464
H  -2.814378 -3.126676 -1.249766
H  -0.333671 -6.601529 1.245397
H  -3.692949 -5.424042 -1.131867
H  -2.458651 -7.173754 0.110777
elementType: O N C H
totalener: -1132.68254417 hartree
nucrepener: 2266.96143512 hartree
electener: -3399.64397929 hartree
oneelecener: -6043.29643811 hartree
twoeener: 2643.65245882 hartree
cpcmener: -0.03644221 hartree
kineticenergy: 1127.65184960 hartree
xcener: -110.662502831089 hartree
chargesum: 0.0000000
charge: -0.301670 -0.463035 -0.341842 -0.096983 0.117534 0.100178 -0.090027 -0.303652 -0.288099 -0.281885 -0.299900 0.352725 0.520289 -0.007529 -0.251419 -0.332106 -0.210017 0.301326 -0.123447 -0.194580 0.242473 -0.227990 -0.165249 -0.139865 -0.160451 -0.169303 0.089799 0.095117 0.097914 0.102811 0.095856 0.100354 0.093183 0.100472 0.095155 0.093794 0.110990 0.100798 0.088423 0.149638 0.141183 0.136489 0.163925 0.161164 0.151307 0.160313 0.161323 0.162565 0.161952
qa: -0.3017 -0.4630 -0.3418 -0.0970 0.1175 0.1002 -0.0900 -0.3037 -0.2881 -0.2819 -0.2999 0.3527 0.5203 -0.0075 -0.2514 -0.3321 -0.2100 0.3013 -0.1234 -0.1946 0.2425 -0.2280 -0.1652 -0.1399 -0.1605 -0.1693 0.0898 0.0951 0.0979 0.1028 0.0959 0.1004 0.0932 0.1005 0.0952 0.0938 0.1110 0.1008 0.0884 0.1496 0.1412 0.1365 0.1639 0.1612 0.1513 0.1603 0.1613 0.1626 0.1620
va: 2.1114 2.0330 2.0318 3.1050 3.7338 3.7140 3.9061 3.8989 3.9045 3.8997 3.9048 4.0991 3.7779 3.7255 4.1151 4.0572 3.9587 3.6805 3.9254 3.9380 3.7147 3.9938 3.9055 3.8889 3.8947 3.8827 1.0334 1.0112 0.9986 0.9989 1.0021 0.9988 1.0049 0.9989 1.0039 1.0052 0.9998 1.0111 1.0079 0.9876 1.0237 1.0159 0.9899 0.9949 1.0040 0.9954 0.9888 0.9893 0.9888
dispcorr: -0.025594522 hartree
energy: -1132.708138693830
dipole: 25.55255 -24.82663 0.72592 -2.49745 -0.04803 -2.54547 1.20053 -2.46932 -1.26879
magnitude: 2.93534 au
magnitude: 7.46104 debye
