program: Orca
programVersion: 5.0.2
elementType: O O O N C C C C C C C C C C C C C C C C C C C C C C H H H H H H H H H H H H H H H H H H H H H H H
charge: 0
multiplicity: 1
keywords: wb97x-d3
keywords: def2-TZVPP
keywords: def2/J RIJCOSX
keywords: DEFGRID2
keywords: scfconv7
keywords: smallprint printgap noloewdin
keywords: NOSOSCF
formula: C22H23NO3
InChI: InChI=1/C22H23NO3/c1-21(2)19(22(21,3)4)20(24)26-18(14-23)15-9-8-12-17(13-15)25-16-10-6-5-7-11-16/h5-13,18-19H,1-4H3
49 atoms
O  0.058793 1.837818 -1.242991
O  0.338983 1.800729 0.969233
O  -2.561714 -2.434626 -0.554958
N  -1.403304 4.547879 0.209227
C  3.41074 1.688953 0.010295
C  3.034636 0.304676 0.430549
C  2.105905 1.068779 -0.504747
C  3.365919 2.833872 0.994516
C  4.48468 1.909771 -1.031178
C  3.719481 -0.889673 -0.199736
C  2.655978 0.00987 1.864391
C  0.790783 1.587249 -0.128912
C  -1.275025 2.267329 -1.068498
C  -2.189769 1.203771 -0.491067
C  -1.329176 3.527291 -0.315935
C  -1.912312 -0.132476 -0.746724
C  -3.344392 1.554785 0.198562
C  -2.786548 -1.108268 -0.287981
C  -4.215399 0.56701 0.632584
C  -3.940316 -0.771591 0.401413
C  -1.328568 -2.970205 -0.270792
C  -0.625506 -2.630743 0.878824
C  -0.831036 -3.916673 -1.15491
C  0.584606 -3.258125 1.139401
C  0.37896 -4.537258 -0.878516
C  1.093551 -4.209984 0.265736
H  2.151581 0.755446 -1.541975
H  2.593314 2.756238 1.75411
H  4.324718 2.906428 1.511508
H  3.209981 3.776202 0.46594
H  4.352995 2.883415 -1.506899
H  5.47226 1.903034 -0.565219
H  4.483129 1.160578 -1.820327
H  3.898421 -0.774095 -1.267093
H  4.679962 -1.081197 0.282956
H  3.104033 -1.78285 -0.071759
H  3.543347 -0.335705 2.398312
H  2.255896 0.853454 2.417341
H  1.919227 -0.793599 1.908229
H  -1.616944 2.507945 -2.079572
H  -1.031537 -0.425077 -1.305133
H  -3.578754 2.59239 0.398786
H  -5.112661 0.843392 1.169717
H  -4.612346 -1.545032 0.74963
H  -1.015051 -1.897102 1.573565
H  -1.388977 -4.16901 -2.047589
H  1.128534 -3.0019 2.039029
H  0.765251 -5.276619 -1.567734
H  2.037155 -4.694389 0.478083
elementType: O N C H
totalener: -1132.68305701 hartree
nucrepener: 2332.38912306 hartree
electener: -3465.07218007 hartree
oneelecener: -6174.02934549 hartree
twoeener: 2708.95716542 hartree
cpcmener: -0.03608344 hartree
kineticenergy: 1127.64520870 hartree
xcener: -110.662239981113 hartree
chargesum: 0.0000000
charge: -0.300189 -0.470950 -0.345060 -0.099774 0.093007 0.110754 -0.115866 -0.300328 -0.279157 -0.281734 -0.301984 0.395052 0.519432 -0.041746 -0.247601 -0.204723 -0.201471 0.229428 -0.123082 -0.220683 0.271456 -0.160961 -0.244044 -0.194921 -0.118664 -0.183236 0.089427 0.094859 0.104205 0.101227 0.096219 0.100569 0.092282 0.094916 0.101138 0.086603 0.102122 0.100150 0.091203 0.152865 0.153160 0.137149 0.163309 0.151336 0.157205 0.148307 0.175479 0.161081 0.162233
qa: -0.3002 -0.4709 -0.3451 -0.0998 0.0930 0.1108 -0.1159 -0.3003 -0.2792 -0.2817 -0.3020 0.3951 0.5194 -0.0417 -0.2476 -0.2047 -0.2015 0.2294 -0.1231 -0.2207 0.2715 -0.1610 -0.2440 -0.1949 -0.1187 -0.1832 0.0894 0.0949 0.1042 0.1012 0.0962 0.1006 0.0923 0.0949 0.1011 0.0866 0.1021 0.1001 0.0912 0.1529 0.1532 0.1371 0.1633 0.1513 0.1572 0.1483 0.1755 0.1611 0.1622
va: 2.1246 2.0247 2.0546 3.1010 3.7633 3.6835 3.9244 3.9164 3.8960 3.9088 3.8939 4.0730 3.7658 3.7432 4.1075 3.9569 3.9509 3.7588 3.9150 4.0200 3.6885 3.8405 4.0027 3.8605 3.8835 3.8568 1.0332 1.0133 0.9977 1.0006 1.0024 0.9986 1.0057 1.0060 0.9996 1.0072 0.9996 1.0138 1.0089 0.9861 1.0118 1.0148 0.9884 1.0031 0.9996 1.0071 0.9791 0.9872 0.9898
dispcorr: -0.027188721 hartree
energy: -1132.710245734399
dipole: 29.58941 -28.36448 1.22493 -3.19031 1.49443 -1.69588 3.77828 -5.12578 -1.34750
magnitude: 2.48841 au
magnitude: 6.32505 debye
