program: Orca
programVersion: 5.0.2
elementType: O O O N C C C C C C C C C C C C C C C C C C C C C C H H H H H H H H H H H H H H H H H H H H H H H
charge: 0
multiplicity: 1
keywords: wb97x-d3
keywords: def2-TZVPP
keywords: def2/J RIJCOSX
keywords: DEFGRID2
keywords: scfconv7
keywords: smallprint printgap noloewdin
keywords: NOSOSCF
formula: C22H23NO3
InChI: InChI=1/C22H23NO3/c1-21(2)19(22(21,3)4)20(24)26-18(14-23)15-9-8-12-17(13-15)25-16-10-6-5-7-11-16/h5-13,18-19H,1-4H3
49 atoms
O  0.846942 1.886819 0.468306
O  0.90142 2.913568 -1.520175
O  -1.375012 -2.878761 1.074619
N  -1.356914 2.354189 2.884798
C  3.954198 2.272013 -1.539134
C  3.909304 3.47432 -0.652396
C  2.944086 2.312701 -0.395722
C  3.513864 2.351058 -2.983381
C  5.067539 1.259084 -1.376735
C  4.973632 3.678012 0.403375
C  3.397112 4.800469 -1.162639
C  1.496216 2.428071 -0.589141
C  -0.577332 1.872212 0.437157
C  -1.086882 0.547511 -0.071903
C  -1.004082 2.134694 1.812259
C  -1.050291 -0.578723 0.742268
C  -1.548511 0.452509 -1.377603
C  -1.476102 -1.798242 0.241285
C  -1.963007 -0.778063 -1.867941
C  -1.926389 -1.909319 -1.06937
C  -2.359662 -3.836758 1.084012
C  -1.953371 -5.151536 1.261749
C  -3.70793 -3.51608 0.984874
C  -2.908286 -6.155096 1.341006
C  -4.650338 -4.532348 1.053409
C  -4.25857 -5.852786 1.230583
H  3.207256 1.702722 0.46117
H  2.786219 3.125326 -3.203258
H  4.388257 2.542016 -3.608822
H  3.089879 1.397919 -3.304378
H  5.970035 1.598962 -1.888777
H  5.326662 1.060525 -0.338862
H  4.77607 0.307622 -1.825335
H  5.863131 4.132755 -0.037544
H  4.609278 4.354689 1.178216
H  5.279098 2.757198 0.896003
H  2.974755 5.382358 -0.341351
H  4.230657 5.375382 -1.571162
H  2.640591 4.732351 -1.938406
H  -0.970259 2.685378 -0.179418
H  -0.700236 -0.519927 1.766602
H  -1.584923 1.329925 -2.009466
H  -2.314371 -0.859741 -2.887529
H  -2.244774 -2.864032 -1.467648
H  -0.899462 -5.385178 1.343342
H  -4.029151 -2.489758 0.859829
H  -2.589956 -7.179464 1.483144
H  -5.700417 -4.284008 0.972801
H  -4.999986 -6.638577 1.285107
elementType: O N C H
totalener: -1132.68413204 hartree
nucrepener: 2170.71788186 hartree
electener: -3303.40201390 hartree
oneelecener: -5850.50106027 hartree
twoeener: 2547.09904637 hartree
cpcmener: -0.03140604 hartree
kineticenergy: 1127.64370873 hartree
xcener: -110.656672583703 hartree
chargesum: 0.0000000
charge: -0.293887 -0.483357 -0.338704 -0.105600 0.104230 0.099166 -0.128437 -0.302912 -0.285151 -0.283158 -0.302043 0.413903 0.426906 -0.001534 -0.218480 -0.227396 -0.172413 0.234534 -0.137957 -0.176475 0.283613 -0.248086 -0.187187 -0.127969 -0.151982 -0.186457 0.087255 0.096812 0.097671 0.102480 0.099317 0.093155 0.096251 0.100235 0.095305 0.093008 0.102504 0.101903 0.096498 0.133565 0.133441 0.147736 0.164103 0.161326 0.149034 0.159281 0.161375 0.162834 0.161746
qa: -0.2939 -0.4834 -0.3387 -0.1056 0.1042 0.0992 -0.1284 -0.3029 -0.2852 -0.2832 -0.3020 0.4139 0.4269 -0.0015 -0.2185 -0.2274 -0.1724 0.2345 -0.1380 -0.1765 0.2836 -0.2481 -0.1872 -0.1280 -0.1520 -0.1865 0.0873 0.0968 0.0977 0.1025 0.0993 0.0932 0.0963 0.1002 0.0953 0.0930 0.1025 0.1019 0.0965 0.1336 0.1334 0.1477 0.1641 0.1613 0.1490 0.1593 0.1614 0.1628 0.1617
va: 2.1173 2.0163 2.0601 3.1069 3.6890 3.7065 3.9205 3.9041 3.9086 3.9061 3.9124 4.0908 3.6978 3.6874 4.0737 4.1155 3.9319 3.7976 3.9053 3.9250 3.6761 3.9999 3.8951 3.8848 3.8883 3.8944 1.0328 1.0117 0.9986 0.9990 0.9988 1.0053 1.0020 0.9987 1.0027 1.0052 0.9991 0.9978 1.0123 1.0244 1.0250 1.0107 0.9898 0.9933 1.0071 0.9960 0.9880 0.9892 0.9892
dispcorr: -0.023010270 hartree
energy: -1132.707142312616
dipole: 27.20054 -26.37647 0.82407 11.69030 -12.55329 -0.86299 -13.22580 11.57936 -1.64643
magnitude: 2.03337 au
magnitude: 5.16841 debye
