program: Orca
programVersion: 5.0.2
elementType: O O O N C C C C C C C C C C C C C C C C C C C C C C H H H H H H H H H H H H H H H H H H H H H H H
charge: 0
multiplicity: 1
keywords: wb97x-d3
keywords: def2-TZVPP
keywords: def2/J RIJCOSX
keywords: DEFGRID2
keywords: scfconv7
keywords: smallprint printgap noloewdin
keywords: NOSOSCF
formula: C22H23NO3
InChI: InChI=1/C22H23NO3/c1-21(2)19(22(21,3)4)20(24)26-18(14-23)15-9-8-12-17(13-15)25-16-10-6-5-7-11-16/h5-13,18-19H,1-4H3
49 atoms
O  0.120346 2.423625 -0.483268
O  1.107699 0.441899 -0.770945
O  -2.783961 -2.521893 0.452372
N  -2.628759 3.897741 -1.54612
C  3.14053 1.62396 1.354147
C  3.768967 1.877361 0.022414
C  2.31063 2.26929 0.237945
C  2.838282 0.218349 1.81871
C  3.462161 2.523058 2.527739
C  4.725215 3.039056 -0.146655
C  4.150842 0.734042 -0.890277
C  1.176632 1.583546 -0.385608
C  -1.092923 1.863107 -0.971594
C  -1.749486 0.968263 0.052901
C  -1.944601 3.012461 -1.279781
C  -1.980528 -0.361823 -0.261508
C  -2.073858 1.467891 1.309268
C  -2.515464 -1.204324 0.704117
C  -2.628546 0.619159 2.25365
C  -2.841646 -0.720225 1.961971
C  -1.917627 -3.274083 -0.302747
C  -2.48393 -4.238355 -1.124369
C  -0.537486 -3.13348 -0.217874
C  -1.66027 -5.071538 -1.867489
C  0.272341 -3.967041 -0.976591
C  -0.280284 -4.937314 -1.802065
H  2.142767 3.332056 0.37159
H  1.985702 0.221785 2.500288
H  2.62038 -0.491421 1.026754
H  3.694787 -0.168877 2.37401
H  4.391088 2.205122 3.005622
H  3.569899 3.570434 2.254163
H  2.670508 2.462645 3.276655
H  4.829558 3.2867 -1.204503
H  4.404913 3.944047 0.365835
H  5.716362 2.775599 0.227859
H  5.200397 0.483674 -0.723811
H  3.577467 -0.176244 -0.75049
H  4.052145 1.030695 -1.935797
H  -0.931876 1.317717 -1.906858
H  -1.732259 -0.732753 -1.248308
H  -1.897707 2.507981 1.554459
H  -2.886891 0.997406 3.23342
H  -3.259599 -1.386807 2.705322
H  -3.56067 -4.337368 -1.177065
H  -0.089506 -2.38831 0.427579
H  -2.104674 -5.824746 -2.504705
H  1.346883 -3.856654 -0.913813
H  0.35935 -5.584205 -2.387297
elementType: O N C H
totalener: -1132.68394447 hartree
nucrepener: 2269.07044910 hartree
electener: -3401.75439357 hartree
oneelecener: -6047.20621641 hartree
twoeener: 2645.45182284 hartree
cpcmener: -0.03256083 hartree
kineticenergy: 1127.65291379 hartree
xcener: -110.659282396465 hartree
chargesum: 0.0000000
charge: -0.288308 -0.479666 -0.338990 -0.103188 0.095962 0.110161 -0.115182 -0.296587 -0.281749 -0.287704 -0.303613 0.389037 0.420583 0.020315 -0.220631 -0.204179 -0.229855 0.284739 -0.126114 -0.229768 0.298848 -0.256735 -0.198833 -0.122183 -0.149383 -0.190050 0.089230 0.100446 0.092775 0.103369 0.100430 0.092296 0.095915 0.095970 0.093533 0.099770 0.098064 0.097141 0.102705 0.137637 0.149564 0.149020 0.162874 0.150944 0.147872 0.158925 0.161519 0.162352 0.160721
qa: -0.2883 -0.4797 -0.3390 -0.1032 0.0960 0.1102 -0.1152 -0.2966 -0.2817 -0.2877 -0.3036 0.3890 0.4206 0.0203 -0.2206 -0.2042 -0.2299 0.2847 -0.1261 -0.2298 0.2988 -0.2567 -0.1988 -0.1222 -0.1494 -0.1901 0.0892 0.1004 0.0928 0.1034 0.1004 0.0923 0.0959 0.0960 0.0935 0.0998 0.0981 0.0971 0.1027 0.1376 0.1496 0.1490 0.1629 0.1509 0.1479 0.1589 0.1615 0.1624 0.1607
va: 2.1254 2.0209 2.0718 3.1112 3.7169 3.6945 3.9177 3.9181 3.9037 3.9070 3.9054 4.1001 3.7293 3.5663 4.0756 3.9390 3.9772 3.7164 3.9038 4.0174 3.6765 4.0063 3.8985 3.8779 3.8904 3.9038 1.0317 0.9995 1.0083 0.9991 0.9988 1.0053 1.0025 1.0020 1.0050 0.9987 0.9985 1.0110 0.9989 1.0180 1.0067 1.0094 0.9881 1.0042 1.0079 0.9962 0.9878 0.9896 0.9895
dispcorr: -0.024928402 hartree
energy: -1132.708872869357
dipole: 32.05563 -30.10453 1.95110 2.89736 -3.52072 -0.62336 8.12141 -7.17650 0.94491
magnitude: 2.25571 au
magnitude: 5.73355 debye
