program: Orca
programVersion: 5.0.2
elementType: O O O N C C C C C C C C C C C C C C C C C C C C C C H H H H H H H H H H H H H H H H H H H H H H H
charge: 0
multiplicity: 1
keywords: wb97x-d3
keywords: def2-TZVPP
keywords: def2/J RIJCOSX
keywords: DEFGRID2
keywords: scfconv7
keywords: smallprint printgap noloewdin
keywords: NOSOSCF
formula: C22H23NO3
InChI: InChI=1/C22H23NO3/c1-21(2)19(22(21,3)4)20(24)26-18(14-23)15-9-8-12-17(13-15)25-16-10-6-5-7-11-16/h5-13,18-19H,1-4H3
49 atoms
O  0.509102 2.264597 0.556107
O  0.894123 2.502378 -1.629762
O  -1.030522 -2.618937 0.73299
N  -2.09527 2.691933 2.543078
C  3.844757 1.716329 -0.933832
C  3.84031 3.186932 -0.673443
C  2.729726 2.319376 -0.077905
C  3.56118 1.170411 -2.314391
C  4.811959 0.818963 -0.192684
C  4.804742 3.778374 0.331594
C  3.544251 4.171881 -1.779854
C  1.33217 2.379219 -0.511779
C  -0.884367 2.209397 0.278267
C  -1.305027 0.858778 -0.25032
C  -1.543743 2.484768 1.555421
C  -1.022396 -0.282919 0.491137
C  -1.957964 0.762503 -1.469305
C  -1.388114 -1.522674 -0.005015
C  -2.323497 -0.487458 -1.950781
C  -2.036347 -1.635079 -1.230531
C  -1.908238 -3.66702 0.87054
C  -3.268762 -3.469169 1.070352
C  -1.368571 -4.945073 0.865697
C  -4.090036 -4.57166 1.259481
C  -2.200831 -6.03695 1.068216
C  -3.563762 -5.856748 1.260155
H  2.833675 2.135895 0.9856
H  4.507455 1.028142 -2.840277
H  3.080844 0.192744 -2.245989
H  2.937565 1.800877 -2.939515
H  4.464106 -0.215019 -0.227641
H  5.797056 0.849456 -0.66275
H  4.934233 1.083026 0.855739
H  4.436705 4.744221 0.682074
H  4.954355 3.152372 1.208619
H  5.780016 3.946507 -0.129757
H  2.849146 3.818669 -2.534973
H  3.134622 5.093498 -1.362629
H  4.474286 4.431666 -2.289389
H  -1.185436 2.998233 -0.418257
H  -0.52053 -0.216944 1.449849
H  -2.177716 1.654731 -2.040897
H  -2.825533 -0.571147 -2.905103
H  -2.3114 -2.605103 -1.62445
H  -3.689231 -2.471604 1.086629
H  -0.30595 -5.082382 0.710858
H  -5.149959 -4.418978 1.415106
H  -1.778742 -7.033245 1.067752
H  -4.210773 -6.710025 1.412611
elementType: O N C H
totalener: -1132.68452712 hartree
nucrepener: 2200.18865243 hartree
electener: -3332.87317955 hartree
oneelecener: -5909.62933568 hartree
twoeener: 2576.75615613 hartree
cpcmener: -0.03292860 hartree
kineticenergy: 1127.65255328 hartree
xcener: -110.658652541005 hartree
chargesum: -0.0000000
charge: -0.296717 -0.479238 -0.339752 -0.103491 0.104389 0.098909 -0.113061 -0.302644 -0.284701 -0.281334 -0.300253 0.390529 0.437175 0.003273 -0.223939 -0.229960 -0.192053 0.223145 -0.133243 -0.169789 0.269617 -0.174436 -0.243889 -0.156258 -0.129586 -0.183676 0.088307 0.099496 0.101937 0.097073 0.095440 0.099534 0.093204 0.095068 0.092854 0.100053 0.096217 0.100585 0.100817 0.140683 0.138371 0.151058 0.164476 0.161980 0.159324 0.149168 0.162327 0.161183 0.161828
qa: -0.2967 -0.4792 -0.3398 -0.1035 0.1044 0.0989 -0.1131 -0.3026 -0.2847 -0.2813 -0.3003 0.3905 0.4372 0.0033 -0.2239 -0.2300 -0.1921 0.2231 -0.1332 -0.1698 0.2696 -0.1744 -0.2439 -0.1563 -0.1296 -0.1837 0.0883 0.0995 0.1019 0.0971 0.0954 0.0995 0.0932 0.0951 0.0929 0.1001 0.0962 0.1006 0.1008 0.1407 0.1384 0.1511 0.1645 0.1620 0.1593 0.1492 0.1623 0.1612 0.1618
va: 2.1219 2.0242 2.0567 3.1104 3.6922 3.7136 3.9209 3.9085 3.9086 3.9041 3.9085 4.0971 3.7034 3.6039 4.0817 4.0760 3.9595 3.7972 3.9001 3.9174 3.6877 3.8884 3.9977 3.8907 3.8868 3.8921 1.0325 0.9986 0.9991 1.0114 1.0023 0.9987 1.0054 1.0028 1.0053 0.9990 1.0130 0.9996 0.9977 1.0158 1.0256 1.0038 0.9893 0.9927 0.9960 1.0068 0.9895 0.9881 0.9890
dispcorr: -0.023464477 hartree
energy: -1132.707991600763
dipole: 28.03207 -27.02086 1.01120 7.16637 -7.90498 -0.73861 -10.05696 8.79054 -1.26642
magnitude: 1.78098 au
magnitude: 4.52689 debye
