program: Orca
programVersion: 5.0.2
elementType: O O O N C C C C C C C C C C C C C C C C C C C C C C H H H H H H H H H H H H H H H H H H H H H H H
charge: 0
multiplicity: 1
keywords: wb97x-d3
keywords: def2-TZVPP
keywords: def2/J RIJCOSX
keywords: DEFGRID2
keywords: scfconv7
keywords: smallprint printgap noloewdin
keywords: NOSOSCF
formula: C22H23NO3
InChI: InChI=1/C22H23NO3/c1-21(2)19(22(21,3)4)20(24)26-18(14-23)15-9-8-12-17(13-15)25-16-10-6-5-7-11-16/h5-13,18-19H,1-4H3
49 atoms
O  0.164763 1.970827 0.731281
O  0.655316 1.901969 -1.444517
O  -2.785068 -2.207266 0.139005
N  -2.1883 3.192875 2.668652
C  3.168347 0.228709 -0.48258
C  3.634698 1.647293 -0.445297
C  2.301676 1.281871 0.208869
C  2.725964 -0.407893 -1.779227
C  3.791277 -0.797554 0.438365
C  4.72632 2.066941 0.51465
C  3.680446 2.48153 -1.704615
C  1.005254 1.73328 -0.301828
C  -1.138809 2.420566 0.402494
C  -2.008329 1.350628 -0.218159
C  -1.715189 2.852145 1.677394
C  -1.956062 0.05113 0.266793
C  -2.873591 1.690576 -1.247814
C  -2.766393 -0.915324 -0.311897
C  -3.698244 0.718259 -1.794226
C  -3.642328 -0.588937 -1.338077
C  -1.610505 -2.845596 0.453962
C  -0.441799 -2.657413 -0.273968
C  -1.654158 -3.750386 1.505456
C  0.689348 -3.385364 0.067782
C  -0.516809 -4.476433 1.828982
C  0.660268 -4.294776 1.116401
H  2.334709 1.241286 1.291638
H  2.004986 -1.203643 -1.582858
H  2.272294 0.27204 -2.49293
H  3.588341 -0.86551 -2.267824
H  4.030294 -0.406935 1.425151
H  3.109436 -1.638355 0.578924
H  4.711947 -1.19079 0.002532
H  4.677403 3.143496 0.68743
H  4.662633 1.581205 1.486068
H  5.709683 1.84753 0.093872
H  3.513414 3.534245 -1.470095
H  4.675737 2.402708 -2.146452
H  2.966197 2.197035 -2.470195
H  -1.103243 3.297211 -0.252777
H  -1.291061 -0.207733 1.082032
H  -2.902111 2.706268 -1.621012
H  -4.377131 0.974641 -2.596157
H  -4.273113 -1.353383 -1.773209
H  -0.404328 -1.960743 -1.10221
H  -2.572978 -3.888353 2.061099
H  1.598952 -3.24318 -0.500974
H  -0.554112 -5.182653 2.647973
H  1.546777 -4.858954 1.372851
elementType: O N C H
totalener: -1132.68415194 hartree
nucrepener: 2310.28384812 hartree
electener: -3442.96800005 hartree
oneelecener: -6129.31465865 hartree
twoeener: 2686.34665859 hartree
cpcmener: -0.03457512 hartree
kineticenergy: 1127.66150690 hartree
xcener: -110.662456696223 hartree
chargesum: 0.0000000
charge: -0.295757 -0.476215 -0.339473 -0.102360 0.110355 0.096421 -0.100062 -0.303083 -0.282094 -0.283585 -0.303759 0.381838 0.422808 0.015134 -0.221484 -0.191854 -0.205600 0.241045 -0.118564 -0.231103 0.296472 -0.185778 -0.264991 -0.158762 -0.113783 -0.202243 0.088745 0.083802 0.101715 0.105781 0.093552 0.090950 0.100548 0.095959 0.093060 0.099734 0.103023 0.099313 0.096501 0.146186 0.149442 0.149247 0.162684 0.151804 0.158792 0.148341 0.175388 0.161238 0.160674
qa: -0.2958 -0.4762 -0.3395 -0.1024 0.1104 0.0964 -0.1001 -0.3031 -0.2821 -0.2836 -0.3038 0.3818 0.4228 0.0151 -0.2215 -0.1919 -0.2056 0.2410 -0.1186 -0.2311 0.2965 -0.1858 -0.2650 -0.1588 -0.1138 -0.2022 0.0887 0.0838 0.1017 0.1058 0.0936 0.0910 0.1005 0.0960 0.0931 0.0997 0.1030 0.0993 0.0965 0.1462 0.1494 0.1492 0.1627 0.1518 0.1588 0.1483 0.1754 0.1612 0.1607
va: 2.1128 2.0229 2.0698 3.1110 3.6827 3.7238 3.9103 3.9094 3.9063 3.9046 3.9094 4.0913 3.7119 3.5969 4.0854 3.9419 3.9773 3.7524 3.8922 4.0089 3.7029 3.8836 4.0104 3.8605 3.8778 3.9307 1.0328 1.0069 1.0153 0.9989 1.0069 1.0072 0.9988 1.0021 1.0056 0.9989 0.9986 0.9985 1.0122 1.0161 1.0154 1.0014 0.9879 1.0033 0.9970 1.0078 0.9773 0.9872 0.9914
dispcorr: -0.026534026 hartree
energy: -1132.710685962278
dipole: 31.75722 -29.92930 1.82792 -2.66890 1.92805 -0.74085 -7.29536 6.28446 -1.01091
magnitude: 2.21632 au
magnitude: 5.63344 debye
