program: Orca
programVersion: 5.0.2
elementType: O O O N C C C C C C C C C C C C C C C C C C C C C C H H H H H H H H H H H H H H H H H H H H H H H
charge: 0
multiplicity: 1
keywords: wb97x-d3
keywords: def2-TZVPP
keywords: def2/J RIJCOSX
keywords: DEFGRID2
keywords: scfconv7
keywords: smallprint printgap noloewdin
keywords: NOSOSCF
formula: C22H23NO3
InChI: InChI=1/C22H23NO3/c1-21(2)19(22(21,3)4)20(24)26-18(14-23)15-9-8-12-17(13-15)25-16-10-6-5-7-11-16/h5-13,18-19H,1-4H3
49 atoms
O  0.196856 2.540483 0.569229
O  1.193977 0.551966 0.433214
O  -2.956488 -2.304086 -0.75592
N  -0.650351 0.659745 3.263359
C  3.823838 2.140762 -0.172294
C  3.151606 2.140897 -1.505777
C  2.355748 2.54936 -0.260003
C  4.241728 0.845502 0.48541
C  4.780639 3.257367 0.187958
C  3.424753 3.252279 -2.494859
C  2.843088 0.846501 -2.2206
C  1.249867 1.745779 0.262126
C  -0.997694 1.900688 0.986761
C  -1.612543 1.045105 -0.101986
C  -0.781654 1.176643 2.244398
C  -2.001035 -0.265924 0.128499
C  -1.788355 1.620089 -1.355933
C  -2.536728 -1.01303 -0.913475
C  -2.341062 0.867102 -2.379859
C  -2.708229 -0.453095 -2.171015
C  -2.369473 -3.135024 0.167623
C  -0.993966 -3.181653 0.363345
C  -3.214984 -3.988647 0.861593
C  -0.474071 -4.089276 1.275262
C  -2.678763 -4.901386 1.759013
C  -1.308391 -4.951309 1.975287
H  2.178281 3.616165 -0.181198
H  4.217314 0.945796 1.572223
H  3.641235 -0.018944 0.221185
H  5.27334 0.622685 0.204025
H  4.452862 4.237434 -0.152432
H  4.899026 3.314238 1.271541
H  5.766666 3.066929 -0.240723
H  4.33628 3.0429 -3.058626
H  2.605437 3.326013 -3.212189
H  3.537761 4.22968 -2.030472
H  2.634353 0.002623 -1.570341
H  1.980948 0.975553 -2.87793
H  3.692402 0.570722 -2.848979
H  -1.677146 2.723283 1.223691
H  -1.880993 -0.711346 1.107871
H  -1.497413 2.646043 -1.539663
H  -2.480316 1.30924 -3.357173
H  -3.128654 -1.043754 -2.97475
H  -0.328243 -2.522206 -0.179861
H  -4.283855 -3.943292 0.69416
H  0.596122 -4.123219 1.432468
H  -3.339942 -5.57025 2.294587
H  -0.892776 -5.658407 2.680569
elementType: O N C H
totalener: -1132.68275391 hartree
nucrepener: 2278.16568535 hartree
electener: -3410.84843927 hartree
oneelecener: -6066.33447498 hartree
twoeener: 2655.48603571 hartree
cpcmener: -0.03522155 hartree
kineticenergy: 1127.64426362 hartree
xcener: -110.661545422336 hartree
chargesum: 0.0000000
charge: -0.300634 -0.478931 -0.334280 -0.092589 0.109867 0.094506 -0.105444 -0.305496 -0.284600 -0.282544 -0.299114 0.403884 0.530879 -0.033121 -0.261857 -0.209761 -0.288695 0.310533 -0.098907 -0.256413 0.307872 -0.212958 -0.259367 -0.141277 -0.120624 -0.190669 0.087668 0.102226 0.096312 0.099326 0.093194 0.095934 0.100157 0.099956 0.095897 0.093446 0.098355 0.098356 0.103352 0.147161 0.137493 0.145644 0.162059 0.149550 0.159879 0.148102 0.162909 0.161319 0.161445
qa: -0.3006 -0.4789 -0.3343 -0.0926 0.1099 0.0945 -0.1054 -0.3055 -0.2846 -0.2825 -0.2991 0.4039 0.5309 -0.0331 -0.2619 -0.2098 -0.2887 0.3105 -0.0989 -0.2564 0.3079 -0.2130 -0.2594 -0.1413 -0.1206 -0.1907 0.0877 0.1022 0.0963 0.0993 0.0932 0.0959 0.1002 0.1000 0.0959 0.0934 0.0984 0.0984 0.1034 0.1472 0.1375 0.1456 0.1621 0.1496 0.1599 0.1481 0.1629 0.1613 0.1614
va: 2.1229 2.0155 2.0790 3.1038 3.7043 3.7149 3.9342 3.9056 3.9031 3.9022 3.9155 4.0472 3.7918 3.7151 4.1138 3.8828 3.9931 3.7543 3.8816 4.0183 3.6598 3.9112 4.0133 3.8792 3.8729 3.9051 1.0331 0.9992 1.0131 0.9984 1.0053 1.0021 0.9986 0.9990 1.0024 1.0051 1.0092 1.0010 0.9985 0.9894 1.0155 1.0105 0.9879 1.0060 0.9989 1.0078 0.9891 0.9880 0.9894
dispcorr: -0.024979332 hartree
energy: -1132.707733243427
dipole: 28.57836 -27.98152 0.59684 10.25586 -8.46286 1.79300 -11.00258 9.11319 -1.88940
magnitude: 2.67225 au
magnitude: 6.79231 debye
