program: Orca
programVersion: 5.0.2
elementType: O O O N C C C C C C C C C C C C C C C C C C C C C C H H H H H H H H H H H H H H H H H H H H H H H
charge: 0
multiplicity: 1
keywords: wb97x-d3
keywords: def2-TZVPP
keywords: def2/J RIJCOSX
keywords: DEFGRID2
keywords: scfconv7
keywords: smallprint printgap noloewdin
keywords: NOSOSCF
formula: C22H23NO3
InChI: InChI=1/C22H23NO3/c1-21(2)19(22(21,3)4)20(24)26-18(14-23)15-9-8-12-17(13-15)25-16-10-6-5-7-11-16/h5-13,18-19H,1-4H3
49 atoms
O  0.051137 2.633871 0.258634
O  0.806864 0.632893 0.887143
O  -2.827029 -2.21009 -0.617234
N  -1.340027 1.591787 3.217891
C  3.636815 1.688313 0.064683
C  3.066337 1.231364 -1.237851
C  2.234321 2.143949 -0.329789
C  3.857018 0.719362 1.203749
C  4.683461 2.781273 0.086605
C  3.533377 1.859906 -2.53239
C  2.668988 -0.211226 -1.451844
C  1.012686 1.684986 0.332449
C  -1.257119 2.295052 0.700755
C  -1.930606 1.319741 -0.236996
C  -1.263978 1.869531 2.104127
C  -2.090708 -0.02245 0.074273
C  -2.351481 1.808871 -1.469689
C  -2.638562 -0.878759 -0.871929
C  -2.920471 0.94663 -2.392762
C  -3.056809 -0.402958 -2.10521
C  -1.885442 -2.906209 0.102677
C  -0.52126 -2.726846 -0.095822
C  -2.355172 -3.84685 1.007424
C  0.372308 -3.498327 0.633116
C  -1.448913 -4.620328 1.719084
C  -0.083437 -4.445902 1.540913
H  2.171507 3.170888 -0.671727
H  3.190802 -0.136972 1.216046
H  4.87772 0.335546 1.150246
H  3.754379 1.231341 2.162175
H  5.669866 2.367549 -0.133494
H  4.492013 3.583479 -0.623032
H  4.731306 3.233108 1.079162
H  4.457598 1.387397 -2.871523
H  2.784292 1.713855 -3.312679
H  3.714567 2.930055 -2.455492
H  1.851535 -0.274553 -2.17262
H  3.515229 -0.757231 -1.873548
H  2.35913 -0.741234 -0.556348
H  -1.800084 3.24263 0.674808
H  -1.789586 -0.406397 1.040781
H  -2.236616 2.858966 -1.706617
H  -3.253334 1.324264 -3.349991
H  -3.488239 -1.082196 -2.82915
H  -0.151498 -2.000899 -0.809466
H  -3.420874 -3.975234 1.148706
H  1.434801 -3.357505 0.482325
H  -1.816911 -5.35682 2.421314
H  0.620538 -5.045646 2.102071
elementType: O N C H
totalener: -1132.68301867 hartree
nucrepener: 2318.62901513 hartree
electener: -3451.31203381 hartree
oneelecener: -6147.16856483 hartree
twoeener: 2695.85653102 hartree
cpcmener: -0.03616663 hartree
kineticenergy: 1127.65491691 hartree
xcener: -110.662365284030 hartree
chargesum: -0.0000000
charge: -0.295051 -0.479381 -0.340360 -0.098244 0.102975 0.105951 -0.118885 -0.302590 -0.285412 -0.283099 -0.293597 0.419200 0.475893 -0.028773 -0.243679 -0.163919 -0.246825 0.254337 -0.112823 -0.237134 0.286606 -0.201409 -0.246294 -0.150645 -0.127130 -0.183956 0.088311 0.097000 0.099236 0.102120 0.099594 0.092588 0.095595 0.100135 0.095900 0.093160 0.103678 0.104499 0.075945 0.147351 0.138546 0.148038 0.162406 0.150731 0.166446 0.147487 0.163326 0.160905 0.161246
qa: -0.2951 -0.4794 -0.3404 -0.0982 0.1030 0.1060 -0.1189 -0.3026 -0.2854 -0.2831 -0.2936 0.4192 0.4759 -0.0288 -0.2437 -0.1639 -0.2468 0.2543 -0.1128 -0.2371 0.2866 -0.2014 -0.2463 -0.1506 -0.1271 -0.1840 0.0883 0.0970 0.0992 0.1021 0.0996 0.0926 0.0956 0.1001 0.0959 0.0932 0.1037 0.1045 0.0759 0.1474 0.1385 0.1480 0.1624 0.1507 0.1664 0.1475 0.1633 0.1609 0.1612
va: 2.1300 2.0138 2.0722 3.1057 3.7030 3.7069 3.9376 3.9079 3.9034 3.9041 3.9251 4.0522 3.8346 3.6382 4.0751 3.8926 3.9958 3.7905 3.8815 4.0191 3.7010 3.8895 4.0039 3.8834 3.8818 3.9048 1.0325 1.0103 0.9982 0.9992 0.9990 1.0056 1.0022 0.9987 1.0025 1.0055 0.9981 1.0004 1.0078 0.9914 1.0208 1.0039 0.9877 1.0041 0.9880 1.0074 0.9890 0.9879 0.9894
dispcorr: -0.026318764 hartree
energy: -1132.709337438797
dipole: 29.87191 -28.79448 1.07743 3.70221 -2.48882 1.21339 -9.60240 7.11474 -2.48767
magnitude: 2.97013 au
magnitude: 7.54946 debye
