program: Orca
programVersion: 5.0.2
elementType: O O O N C C C C C C C C C C C C C C C C C C C C C C H H H H H H H H H H H H H H H H H H H H H H H
charge: 0
multiplicity: 1
keywords: wb97x-d3
keywords: def2-TZVPP
keywords: def2/J RIJCOSX
keywords: DEFGRID2
keywords: scfconv7
keywords: smallprint printgap noloewdin
keywords: NOSOSCF
formula: C22H23NO3
InChI: InChI=1/C22H23NO3/c1-21(2)19(22(21,3)4)20(24)26-18(14-23)15-9-8-12-17(13-15)25-16-10-6-5-7-11-16/h5-13,18-19H,1-4H3
49 atoms
O  0.134677 2.569517 0.630107
O  0.660013 2.159697 -1.500453
O  -1.862998 -1.99981 1.233622
N  -2.439157 3.891413 2.226091
C  3.075373 0.641965 -0.085578
C  3.626033 1.958678 -0.539814
C  2.319446 1.933602 0.234532
C  2.507984 -0.34425 -1.081672
C  3.687618 -0.078697 1.096032
C  4.800342 2.575536 0.192321
C  3.663972 2.317826 -2.008805
C  1.001013 2.221739 -0.351642
C  -1.217519 2.713029 0.238798
C  -1.870497 1.383128 -0.065558
C  -1.886809 3.371795 1.363628
C  -1.571645 0.274943 0.716101
C  -2.756094 1.271811 -1.124125
C  -2.160934 -0.943309 0.425742
C  -3.355716 0.050062 -1.393548
C  -3.061761 -1.063408 -0.626455
C  -1.427944 -3.169029 0.681648
C  -1.702417 -4.332476 1.388034
C  -0.702297 -3.219279 -0.502755
C  -1.248722 -5.548944 0.905466
C  -0.261823 -4.446545 -0.976429
C  -0.531527 -5.61478 -0.280608
H  2.393221 2.24638 1.270535
H  1.789499 -1.001395 -0.587046
H  2.003183 0.109238 -1.928597
H  3.310519 -0.974583 -1.469198
H  2.959983 -0.760882 1.538831
H  4.544356 -0.675477 0.77694
H  4.026353 0.58758 1.886488
H  4.754715 2.452769 1.272576
H  5.740374 2.140188 -0.151647
H  4.842559 3.647655 -0.006002
H  3.619515 3.400955 -2.13252
H  4.610011 1.979715 -2.436116
H  2.859638 1.894709 -2.599581
H  -1.305112 3.368472 -0.63477
H  -0.881933 0.343414 1.547934
H  -2.97378 2.131324 -1.744913
H  -4.052295 -0.037735 -2.216271
H  -3.524957 -2.017576 -0.841856
H  -2.266475 -4.275147 2.309657
H  -0.478591 -2.315112 -1.054441
H  -1.46564 -6.452894 1.459094
H  0.302579 -4.48282 -1.898933
H  -0.184634 -6.567226 -0.657307
totalener: -1132.67371292 hartree
nucrepener: 2274.09955351 hartree
electener: -3406.77326643 hartree
oneelecener: -6056.56052285 hartree
twoeener: 2649.78725642 hartree
kineticenergy: 1127.72739500 hartree
xcener: -110.667105600726 hartree
chargesum: -0.0000000
charge: -0.272915 -0.372259 -0.298055 -0.000831 0.078441 0.098210 -0.112497 -0.273805 -0.254148 -0.259628 -0.270859 0.298737 0.314150 0.059287 -0.253058 -0.212654 -0.138334 0.182517 -0.103820 -0.138164 0.258335 -0.206106 -0.176286 -0.093104 -0.135558 -0.141451 0.079490 0.075419 0.104634 0.096222 0.094013 0.092764 0.078593 0.078574 0.093531 0.091230 0.088658 0.086255 0.103692 0.122875 0.126787 0.106499 0.129576 0.137062 0.126916 0.133856 0.125991 0.126317 0.124903
qa: -0.2729 -0.3723 -0.2981 -0.0008 0.0784 0.0982 -0.1125 -0.2738 -0.2541 -0.2596 -0.2709 0.2987 0.3141 0.0593 -0.2531 -0.2127 -0.1383 0.1825 -0.1038 -0.1382 0.2583 -0.2061 -0.1763 -0.0931 -0.1356 -0.1415 0.0795 0.0754 0.1046 0.0962 0.0940 0.0928 0.0786 0.0786 0.0935 0.0912 0.0887 0.0863 0.1037 0.1229 0.1268 0.1065 0.1296 0.1371 0.1269 0.1339 0.1260 0.1263 0.1249
va: 2.1085 2.1208 2.1054 3.1226 3.7523 3.7356 3.9155 3.9256 3.9041 3.9063 3.9153 4.2045 3.8353 3.6490 4.0192 4.0431 4.0368 3.8930 3.9536 3.9709 3.7825 4.0264 3.9016 3.9438 3.9823 3.9605 1.0328 1.0033 1.0148 1.0022 1.0053 1.0014 1.0099 1.0095 1.0009 1.0060 1.0038 0.9991 1.0171 1.0184 1.0294 1.0128 1.0005 1.0006 1.0138 1.0028 0.9986 1.0011 1.0004
dispcorr: -0.025289702 hartree
energy: -1132.699002625092
dipole: 29.27415 -28.18714 1.08700 -4.63800 3.50234 -1.13566 -8.20436 7.18207 -1.02229
magnitude: 1.87520 au
magnitude: 4.76638 debye
