program: Orca
programVersion: 5.0.2
elementType: O O O N C C C C C C C C C C C C C C C C C C C C C C H H H H H H H H H H H H H H H H H H H H H H H
charge: 0
multiplicity: 1
keywords: wb97x-d3
keywords: def2-TZVPP
keywords: def2/J RIJCOSX
keywords: DEFGRID2
keywords: scfconv7
keywords: smallprint printgap noloewdin
keywords: NOSOSCF
formula: C22H23NO3
InChI: InChI=1/C22H23NO3/c1-21(2)19(22(21,3)4)20(24)26-18(14-23)15-9-8-12-17(13-15)25-16-10-6-5-7-11-16/h5-13,18-19H,1-4H3
49 atoms
O  0.811149 1.283935 0.531394
O  0.809361 2.984856 -0.920183
O  -2.426649 -2.82013 -0.64963
N  -0.983312 0.920808 3.297566
C  3.594801 1.917376 -1.83738
C  3.945433 2.714192 -0.619457
C  2.809015 1.69614 -0.551714
C  2.961008 2.58293 -3.038124
C  4.478324 0.765046 -2.268863
C  5.182859 2.373763 0.182641
C  3.651053 4.19593 -0.557477
C  1.401208 2.089887 -0.378537
C  -0.569853 1.505857 0.784322
C  -1.433229 0.66721 -0.125768
C  -0.785423 1.171148 2.19442
C  -1.522786 -0.704554 0.079321
C  -2.09544 1.266818 -1.186746
C  -2.305389 -1.472776 -0.770679
C  -2.863769 0.485473 -2.037742
C  -2.977779 -0.877356 -1.832405
C  -2.343035 -3.414608 0.579953
C  -1.56243 -4.555156 0.686836
C  -3.05362 -2.937747 1.674338
C  -1.495051 -5.22447 1.899663
C  -2.966809 -3.6091 2.88338
C  -2.189904 -4.752557 3.002739
H  3.054883 0.78484 -0.017724
H  3.747042 2.942123 -3.70529
H  2.364173 1.860474 -3.597237
H  2.31338 3.41993 -2.80372
H  3.914563 0.079303 -2.903331
H  5.326486 1.13006 -2.851305
H  4.873254 0.181928 -1.439385
H  6.064098 2.847111 -0.254846
H  5.083484 2.744768 1.203906
H  5.379797 1.305825 0.246862
H  4.486257 4.751795 -0.987789
H  2.748156 4.497669 -1.077685
H  3.549029 4.515396 0.481204
H  -0.819087 2.563046 0.653234
H  -0.996099 -1.167385 0.905543
H  -2.005135 2.331809 -1.352632
H  -3.386862 0.945134 -2.865402
H  -3.584752 -1.489474 -2.486378
H  -1.01949 -4.914179 -0.177539
H  -3.667142 -2.050186 1.58775
H  -0.888129 -6.116397 1.981461
H  -3.514472 -3.233183 3.737141
H  -2.128548 -5.272055 3.94919
totalener: -1132.67607609 hartree
nucrepener: 2217.79055584 hartree
electener: -3350.46663193 hartree
oneelecener: -5944.33238630 hartree
twoeener: 2593.86575437 hartree
kineticenergy: 1127.72577986 hartree
xcener: -110.667325142383 hartree
chargesum: -0.0000000
charge: -0.267903 -0.401639 -0.297841 -0.006542 0.082953 0.076784 -0.118505 -0.270797 -0.256953 -0.254402 -0.278993 0.358456 0.337421 0.007065 -0.264218 -0.187371 -0.137574 0.219809 -0.091919 -0.202003 0.245013 -0.210143 -0.167472 -0.091027 -0.100127 -0.143025 0.075552 0.087283 0.088646 0.103421 0.090606 0.092619 0.077786 0.092193 0.091985 0.077838 0.090468 0.103890 0.089691 0.117307 0.128480 0.120629 0.127475 0.127594 0.124539 0.132593 0.125351 0.129050 0.125957
qa: -0.2679 -0.4016 -0.2978 -0.0065 0.0830 0.0768 -0.1185 -0.2708 -0.2570 -0.2544 -0.2790 0.3585 0.3374 0.0071 -0.2642 -0.1874 -0.1376 0.2198 -0.0919 -0.2020 0.2450 -0.2101 -0.1675 -0.0910 -0.1001 -0.1430 0.0756 0.0873 0.0886 0.1034 0.0906 0.0926 0.0778 0.0922 0.0920 0.0778 0.0905 0.1039 0.0897 0.1173 0.1285 0.1206 0.1275 0.1276 0.1245 0.1326 0.1254 0.1291 0.1260
va: 2.1312 2.0908 2.1151 3.1178 3.7233 3.7375 3.9315 3.9183 3.9081 3.9056 3.9246 4.1602 3.8184 3.6830 4.0274 3.9873 3.9783 3.8578 3.9528 4.0357 3.8001 4.0462 3.9584 3.9313 3.9489 3.9645 1.0335 0.9991 1.0033 1.0175 1.0059 1.0011 1.0103 1.0009 1.0060 1.0103 0.9994 1.0167 1.0027 1.0256 1.0157 1.0201 0.9998 1.0121 1.0137 1.0035 0.9989 0.9998 1.0004
dispcorr: -0.023578950 hartree
energy: -1132.699655042154
dipole: 28.79544 -28.05903 0.73641 11.93998 -12.07231 -0.13233 -11.21943 10.21004 -1.00939
magnitude: 1.25646 au
magnitude: 3.19366 debye
