program: Orca
programVersion: 5.0.2
elementType: O O O N C C C C C C C C C C C C C C C C C C C C C C H H H H H H H H H H H H H H H H H H H H H H H
charge: 0
multiplicity: 1
keywords: wb97x-d3
keywords: def2-TZVPP
keywords: def2/J RIJCOSX
keywords: DEFGRID2
keywords: scfconv7
keywords: smallprint printgap noloewdin
keywords: NOSOSCF
formula: C22H23NO3
InChI: InChI=1/C22H23NO3/c1-21(2)19(22(21,3)4)20(24)26-18(14-23)15-9-8-12-17(13-15)25-16-10-6-5-7-11-16/h5-13,18-19H,1-4H3
49 atoms
O  0.419276 1.810006 0.306337
O  0.396412 3.087053 -1.520534
O  -2.793016 -2.386368 -0.458052
N  -1.387946 1.814377 3.065391
C  3.484301 1.899037 0.14786
C  3.109159 0.699795 -0.669401
C  2.428297 2.036528 -0.944634
C  3.129702 1.982479 1.616182
C  4.790858 2.617349 -0.120563
C  4.036047 0.20728 -1.762212
C  2.362674 -0.461615 -0.051887
C  1.000882 2.368521 -0.77142
C  -0.962827 2.080848 0.500451
C  -1.83389 1.147391 -0.304113
C  -1.191203 1.927462 1.93961
C  -1.877524 -0.203707 0.021804
C  -2.561948 1.638858 -1.375944
C  -2.662183 -1.062251 -0.734621
C  -3.35279 0.771877 -2.116201
C  -3.403134 -0.574393 -1.80573
C  -1.786355 -3.049416 0.188857
C  -0.491784 -3.057128 -0.313942
C  -2.103601 -3.760245 1.335205
C  0.489812 -3.776368 0.34829
C  -1.11436 -4.486512 1.982139
C  0.184086 -4.493315 1.496622
H  2.789356 2.532984 -1.838789
H  2.230784 1.449352 1.9044
H  3.953168 1.576249 2.206707
H  3.000779 3.023753 1.916054
H  4.74381 3.637211 0.264061
H  5.616915 2.113537 0.384976
H  5.04235 2.684789 -1.176822
H  4.820282 -0.427004 -1.344025
H  3.479487 -0.391339 -2.485323
H  4.520019 1.00837 -2.316664
H  1.721255 -0.206756 0.783736
H  1.736819 -0.947897 -0.802285
H  3.080719 -1.203505 0.303392
H  -1.191765 3.117274 0.234706
H  -1.317829 -0.578523 0.870694
H  -2.505537 2.686526 -1.637924
H  -3.926827 1.14769 -2.952275
H  -4.015732 -1.255579 -2.381395
H  -0.254777 -2.508693 -1.216884
H  -3.117896 -3.744283 1.711452
H  1.498917 -3.780772 -0.042217
H  -1.362358 -5.042627 2.876318
H  0.953303 -5.056496 2.007212
totalener: -1132.67092261 hartree
nucrepener: 2309.97524679 hartree
electener: -3442.64616940 hartree
oneelecener: -6128.31386571 hartree
twoeener: 2685.66769631 hartree
kineticenergy: 1127.72942016 hartree
xcener: -110.667662953306 hartree
chargesum: -0.0000000
charge: -0.264866 -0.364136 -0.298222 -0.000641 0.091506 0.130031 -0.157445 -0.265945 -0.265987 -0.263028 -0.292772 0.360904 0.288136 0.033088 -0.274329 -0.185050 -0.130852 0.210187 -0.091065 -0.199437 0.237375 -0.182451 -0.187022 -0.108329 -0.097638 -0.136137 0.080000 0.095215 0.088139 0.093257 0.092637 0.091727 0.078499 0.091411 0.090683 0.079888 0.092566 0.078536 0.089506 0.122816 0.131385 0.116635 0.128119 0.128071 0.136517 0.126942 0.127464 0.127554 0.126558
qa: -0.2649 -0.3641 -0.2982 -0.0006 0.0915 0.1300 -0.1574 -0.2659 -0.2660 -0.2630 -0.2928 0.3609 0.2881 0.0331 -0.2743 -0.1850 -0.1309 0.2102 -0.0911 -0.1994 0.2374 -0.1825 -0.1870 -0.1083 -0.0976 -0.1361 0.0800 0.0952 0.0881 0.0933 0.0926 0.0917 0.0785 0.0914 0.0907 0.0799 0.0926 0.0785 0.0895 0.1228 0.1314 0.1166 0.1281 0.1281 0.1365 0.1269 0.1275 0.1276 0.1266
va: 2.1059 2.1472 2.1173 3.1149 3.7087 3.6875 3.9346 3.9267 3.9183 3.9166 3.9235 4.2101 3.8817 3.6261 4.0185 3.9454 3.9993 3.8810 3.9574 4.0358 3.8237 3.9601 4.0445 3.9227 3.9400 3.9722 1.0303 1.0102 1.0004 1.0035 1.0051 1.0008 1.0106 1.0012 1.0041 1.0115 1.0139 1.0048 1.0017 1.0185 1.0126 1.0207 0.9994 1.0120 0.9994 1.0124 0.9988 0.9986 1.0001
dispcorr: -0.026950173 hartree
energy: -1132.697872783844
dipole: 29.46293 -28.44664 1.01628 -0.03312 -0.60368 -0.63680 -2.36509 1.59621 -0.76888
magnitude: 1.42461 au
magnitude: 3.62107 debye
