program: Orca
programVersion: 5.0.2
elementType: O O O N C C C C C C C C C C C C C C C C C C C C C C H H H H H H H H H H H H H H H H H H H H H H H
charge: 0
multiplicity: 1
keywords: wb97x-d3
keywords: def2-TZVPP
keywords: def2/J RIJCOSX
keywords: DEFGRID2
keywords: scfconv7
keywords: smallprint printgap noloewdin
keywords: NOSOSCF
formula: C22H23NO3
InChI: InChI=1/C22H23NO3/c1-21(2)19(22(21,3)4)20(24)26-18(14-23)15-9-8-12-17(13-15)25-16-10-6-5-7-11-16/h5-13,18-19H,1-4H3
49 atoms
O  0.139807 2.360695 -0.486279
O  1.234995 0.427582 -0.711527
O  -2.750646 -2.553536 0.738205
N  -2.632458 3.617503 -1.797223
C  3.295587 1.758758 1.2709
C  3.804358 2.126666 -0.0878
C  2.332783 2.348981 0.2431
C  3.188998 0.30858 1.685087
C  3.602305 2.639194 2.464022
C  4.630211 3.382315 -0.272783
C  4.229001 1.057068 -1.069033
C  1.234044 1.576773 -0.36089
C  -1.034112 1.723974 -0.968706
C  -1.702812 0.897156 0.103642
C  -1.915635 2.801137 -1.424596
C  -1.903272 -0.456652 -0.111317
C  -2.090386 1.490613 1.298023
C  -2.490327 -1.229042 0.883719
C  -2.680162 0.711604 2.279501
C  -2.876806 -0.645345 2.082705
C  -2.000096 -3.327231 -0.1027
C  -2.680797 -4.200859 -0.9366
C  -0.611016 -3.293771 -0.09352
C  -1.964628 -5.052416 -1.764028
C  0.091444 -4.141836 -0.935067
C  -0.57833 -5.024225 -1.770688
H  2.06229 3.383154 0.425648
H  2.941753 -0.372852 0.87795
H  4.137397 -0.014997 2.119227
H  2.422121 0.192483 2.453281
H  2.875259 2.462794 3.258286
H  4.590992 2.408743 2.865937
H  3.57774 3.703156 2.237771
H  5.676626 3.192195 -0.025811
H  4.592412 3.706315 -1.314035
H  4.293942 4.219349 0.335684
H  4.130053 1.42432 -2.092041
H  5.28252 0.818528 -0.90961
H  3.664115 0.133731 -1.003451
H  -0.80538 1.092119 -1.833191
H  -1.589604 -0.905433 -1.045062
H  -1.939477 2.549991 1.460587
H  -2.988819 1.163062 3.212777
H  -3.333033 -1.257411 2.849517
H  -3.762764 -4.212578 -0.92752
H  -0.079336 -2.610236 0.556234
H  -2.497196 -5.736285 -2.411595
H  1.172888 -4.112519 -0.931404
H  -0.022824 -5.685154 -2.422031
totalener: -1132.67522290 hartree
nucrepener: 2254.90000459 hartree
electener: -3387.57522749 hartree
oneelecener: -6018.34117844 hartree
twoeener: 2630.76595095 hartree
kineticenergy: 1127.72099106 hartree
xcener: -110.666375124880 hartree
chargesum: 0.0000000
charge: -0.265812 -0.395029 -0.296001 -0.002929 0.081857 0.083780 -0.117934 -0.273724 -0.255373 -0.255281 -0.272960 0.341764 0.318344 0.016324 -0.253904 -0.141775 -0.198707 0.241947 -0.086811 -0.203121 0.254641 -0.213151 -0.175258 -0.088782 -0.103940 -0.145497 0.077447 0.097613 0.091814 0.089618 0.090337 0.093135 0.078359 0.092386 0.091366 0.078187 0.088442 0.088369 0.102559 0.112980 0.118211 0.122401 0.127946 0.128037 0.125980 0.133165 0.126184 0.127271 0.125525
qa: -0.2658 -0.3950 -0.2960 -0.0029 0.0819 0.0838 -0.1179 -0.2737 -0.2554 -0.2553 -0.2730 0.3418 0.3183 0.0163 -0.2539 -0.1418 -0.1987 0.2419 -0.0868 -0.2031 0.2546 -0.2132 -0.1753 -0.0888 -0.1039 -0.1455 0.0774 0.0976 0.0918 0.0896 0.0903 0.0931 0.0784 0.0924 0.0914 0.0782 0.0884 0.0884 0.1026 0.1130 0.1182 0.1224 0.1279 0.1280 0.1260 0.1332 0.1262 0.1273 0.1255
va: 2.1323 2.0988 2.1200 3.1222 3.7332 3.7305 3.9369 3.9260 3.9066 3.9064 3.9210 4.1625 3.8526 3.6578 4.0164 3.9261 4.0382 3.8685 3.9386 4.0343 3.7949 4.0485 3.9623 3.9297 3.9412 3.9639 1.0331 1.0154 0.9998 1.0028 1.0060 1.0011 1.0103 1.0011 1.0060 1.0100 1.0036 0.9990 1.0172 1.0230 1.0167 1.0176 0.9992 1.0123 1.0140 1.0042 0.9989 0.9997 1.0005
dispcorr: -0.024284918 hartree
energy: -1132.699507818255
dipole: 32.34046 -30.88015 1.46031 4.89021 -5.54393 -0.65372 6.97879 -6.23047 0.74832
magnitude: 1.76631 au
magnitude: 4.48960 debye
