program: Orca
programVersion: 5.0.2
elementType: O O O N C C C C C C C C C C C C C C C C C C C C C C H H H H H H H H H H H H H H H H H H H H H H H
charge: 0
multiplicity: 1
keywords: wb97x-d3
keywords: def2-TZVPP
keywords: def2/J RIJCOSX
keywords: DEFGRID2
keywords: scfconv7
keywords: smallprint printgap noloewdin
keywords: NOSOSCF
formula: C22H23NO3
InChI: InChI=1/C22H23NO3/c1-21(2)19(22(21,3)4)20(24)26-18(14-23)15-9-8-12-17(13-15)25-16-10-6-5-7-11-16/h5-13,18-19H,1-4H3
49 atoms
O  0.677064 1.949143 0.115349
O  1.616591 2.205049 -1.900777
O  -2.719855 -2.598319 -0.665564
N  -1.98461 3.936846 -0.267109
C  4.337363 2.062777 -0.328259
C  3.967912 3.511947 -0.285123
C  2.929229 2.461525 0.100702
C  4.577624 1.36574 -1.648545
C  5.212132 1.472944 0.758469
C  4.459005 4.390687 0.846052
C  3.825418 4.309024 -1.56208
C  1.72503 2.202801 -0.70515
C  -0.592089 1.731408 -0.477756
C  -1.281143 0.592189 0.228517
C  -1.369274 2.971525 -0.361435
C  -1.673691 -0.516299 -0.502405
C  -1.509598 0.644312 1.598914
C  -2.312674 -1.575996 0.130831
C  -2.140193 -0.418633 2.220204
C  -2.548553 -1.53131 1.497929
C  -2.807503 -3.868549 -0.16777
C  -1.757192 -4.453465 0.528558
C  -3.963656 -4.5850 -0.435136
C  -1.877703 -5.764281 0.961807
C  -4.0667 -5.899387 -0.004709
C  -3.029366 -6.492455 0.698687
H  2.74277 2.383604 1.166019
H  4.396239 0.294464 -1.546049
H  3.957854 1.719983 -2.464803
H  5.621942 1.492358 -1.940561
H  5.076152 0.391332 0.805859
H  6.265981 1.662011 0.545058
H  5.001073 1.866721 1.750574
H  3.820386 5.270114 0.940629
H  4.46511 3.89375 1.814011
H  5.473629 4.741283 0.646778
H  4.794985 4.731304 -1.833328
H  3.460248 3.741567 -2.41089
H  3.137818 5.142706 -1.410675
H  -0.48694 1.505142 -1.542551
H  -1.495771 -0.570318 -1.569531
H  -1.207335 1.5095 2.174234
H  -2.330638 -0.382482 3.284387
H  -3.053344 -2.34691 1.998593
H  -0.851769 -3.893801 0.726102
H  -4.76949 -4.11389 -0.982349
H  -1.059493 -6.220716 1.503023
H  -4.967862 -6.459076 -0.217516
H  -3.115101 -7.516163 1.03671
totalener: -1132.67503107 hartree
nucrepener: 2153.21244528 hartree
electener: -3285.88747634 hartree
oneelecener: -5814.89728987 hartree
twoeener: 2529.00981353 hartree
kineticenergy: 1127.72387360 hartree
xcener: -110.665774397051 hartree
chargesum: -0.0000000
charge: -0.276188 -0.390336 -0.296118 -0.001830 0.088373 0.083706 -0.143415 -0.276332 -0.254434 -0.256295 -0.275699 0.362790 0.327705 0.045087 -0.270665 -0.174794 -0.185986 0.209041 -0.110553 -0.150580 0.231907 -0.162831 -0.197743 -0.114739 -0.096208 -0.138287 0.074092 0.085996 0.105934 0.088926 0.089225 0.092326 0.077171 0.093432 0.076164 0.092698 0.088226 0.105605 0.092448 0.114599 0.116409 0.122942 0.130046 0.134431 0.133858 0.127322 0.127945 0.127282 0.127350
qa: -0.2762 -0.3903 -0.2961 -0.0018 0.0884 0.0837 -0.1434 -0.2763 -0.2544 -0.2563 -0.2757 0.3628 0.3277 0.0451 -0.2707 -0.1748 -0.1860 0.2090 -0.1106 -0.1506 0.2319 -0.1628 -0.1977 -0.1147 -0.0962 -0.1383 0.0741 0.0860 0.1059 0.0889 0.0892 0.0923 0.0772 0.0934 0.0762 0.0927 0.0882 0.1056 0.0924 0.1146 0.1164 0.1229 0.1300 0.1344 0.1339 0.1273 0.1279 0.1273 0.1273
va: 2.1409 2.1066 2.1079 3.1217 3.7150 3.7296 3.9398 3.9225 3.9073 3.9065 3.9249 4.1636 3.7903 3.7562 4.0440 4.0313 4.0513 3.9135 3.9564 3.9395 3.8110 3.9559 4.0370 3.9450 3.9346 3.9573 1.0317 1.0033 1.0174 0.9991 1.0061 1.0013 1.0100 1.0062 1.0099 1.0008 0.9989 1.0163 1.0029 1.0436 1.0224 1.0177 1.0007 1.0038 1.0029 1.0128 0.9997 0.9988 0.9999
dispcorr: -0.022477852 hartree
energy: -1132.697508918475
dipole: 32.59212 -31.51932 1.07279 8.32776 -9.86761 -1.53986 2.48854 -1.53767 0.95087
magnitude: 2.10385 au
magnitude: 5.34757 debye
