program: Orca
programVersion: 5.0.2
elementType: O O O N C C C C C C C C C C C C C C C C C C C C C C H H H H H H H H H H H H H H H H H H H H H H H
charge: 0
multiplicity: 1
keywords: wb97x-d3
keywords: def2-TZVPP
keywords: def2/J RIJCOSX
keywords: DEFGRID2
keywords: scfconv7
keywords: smallprint printgap noloewdin
keywords: NOSOSCF
formula: C22H23NO3
InChI: InChI=1/C22H23NO3/c1-21(2)19(22(21,3)4)20(24)26-18(14-23)15-9-8-12-17(13-15)25-16-10-6-5-7-11-16/h5-13,18-19H,1-4H3
49 atoms
O  0.572241 1.896989 0.192189
O  1.118556 3.055052 -1.64718
O  -2.036354 -2.27321 1.504017
N  -1.719215 3.395641 2.094328
C  3.971712 1.815591 -1.289421
C  3.99916 2.971484 -0.339184
C  2.820111 2.000638 -0.309077
C  3.784916 2.041044 -2.77295
C  4.853318 0.610331 -1.037399
C  4.9063 2.940504 0.872255
C  3.815717 4.384899 -0.84311
C  1.457772 2.39429 -0.703874
C  -0.807487 2.148933 -0.016045
C  -1.545485 0.852122 -0.234995
C  -1.307568 2.846752 1.172896
C  -1.455613 -0.15907 0.711404
C  -2.298556 0.67002 -1.38483
C  -2.134186 -1.3513 0.511786
C  -2.978197 -0.524246 -1.572129
C  -2.906699 -1.537175 -0.6313
C  -2.219628 -3.601816 1.241644
C  -1.522622 -4.249254 0.229088
C  -3.084011 -4.305606 2.065605
C  -1.705726 -5.610237 0.04324
C  -3.248694 -5.669518 1.876481
C  -2.566995 -6.325921 0.863037
H  2.826754 1.317754 0.533217
H  3.371012 1.14573 -3.23978
H  3.128928 2.866238 -3.025769
H  4.75663 2.229009 -3.233723
H  4.452498 -0.262602 -1.554949
H  5.860457 0.786069 -1.420481
H  4.942458 0.346252 0.014386
H  4.968819 1.962238 1.344196
H  5.91948 3.242648 0.599913
H  4.546712 3.639516 1.628841
H  4.786539 4.800086 -1.120477
H  3.158651 4.475379 -1.701558
H  3.405968 5.016131 -0.052714
H  -0.95166 2.808468 -0.87686
H  -0.870823 -0.028647 1.613667
H  -2.358227 1.453849 -2.128833
H  -3.577571 -0.668663 -2.460844
H  -3.453121 -2.458114 -0.78525
H  -0.839458 -3.698018 -0.404622
H  -3.614033 -3.784537 2.851978
H  -1.163048 -6.115317 -0.74485
H  -3.920099 -6.21843 2.52335
H  -2.701645 -7.388712 0.715043
totalener: -1132.67488718 hartree
nucrepener: 2171.84185337 hartree
electener: -3304.51674055 hartree
oneelecener: -5852.17276386 hartree
twoeener: 2547.65602331 hartree
kineticenergy: 1127.72524453 hartree
xcener: -110.666511059695 hartree
chargesum: -0.0000000
charge: -0.279394 -0.391350 -0.292136 -0.003350 0.091214 0.079632 -0.140216 -0.273073 -0.255766 -0.255278 -0.278388 0.361205 0.333207 0.030030 -0.262658 -0.218829 -0.140373 0.225664 -0.113448 -0.163727 0.235377 -0.173162 -0.195668 -0.112925 -0.096056 -0.137771 0.075125 0.085281 0.105433 0.087919 0.089281 0.092301 0.077549 0.077180 0.092728 0.092460 0.089839 0.103449 0.092614 0.116925 0.122061 0.116506 0.129874 0.135780 0.134096 0.128419 0.127934 0.127365 0.127118
qa: -0.2794 -0.3914 -0.2921 -0.0033 0.0912 0.0796 -0.1402 -0.2731 -0.2558 -0.2553 -0.2784 0.3612 0.3332 0.0300 -0.2627 -0.2188 -0.1404 0.2257 -0.1134 -0.1637 0.2354 -0.1732 -0.1957 -0.1129 -0.0961 -0.1378 0.0751 0.0853 0.1054 0.0879 0.0893 0.0923 0.0775 0.0772 0.0927 0.0925 0.0898 0.1034 0.0926 0.1169 0.1221 0.1165 0.1299 0.1358 0.1341 0.1284 0.1279 0.1274 0.1271
va: 2.1272 2.1088 2.1160 3.1188 3.7095 3.7359 3.9311 3.9185 3.9091 3.9068 3.9274 4.1683 3.7839 3.7621 4.0460 4.0991 3.9793 3.8844 3.9727 3.9424 3.8073 3.9629 4.0395 3.9405 3.9337 3.9567 1.0322 1.0036 1.0181 0.9991 1.0062 1.0012 1.0100 1.0102 1.0007 1.0063 0.9992 1.0160 1.0026 1.0425 1.0306 1.0107 1.0017 1.0039 1.0025 1.0128 0.9997 0.9989 1.0002
dispcorr: -0.022621852 hartree
energy: -1132.697509033184
dipole: 30.56283 -29.75916 0.80367 4.94179 -6.47763 -1.53584 -10.27096 9.25501 -1.01595
magnitude: 2.00919 au
magnitude: 5.10695 debye
