program: Orca
programVersion: 5.0.2
elementType: O O O N C C C C C C C C C C C C C C C C C C C C C C H H H H H H H H H H H H H H H H H H H H H H H
charge: 0
multiplicity: 1
keywords: wb97x-d3
keywords: def2-TZVPP
keywords: def2/J RIJCOSX
keywords: DEFGRID2
keywords: scfconv7
keywords: smallprint printgap noloewdin
keywords: NOSOSCF
formula: C22H23NO3
InChI: InChI=1/C22H23NO3/c1-21(2)19(22(21,3)4)20(24)26-18(14-23)15-9-8-12-17(13-15)25-16-10-6-5-7-11-16/h5-13,18-19H,1-4H3
49 atoms
O  0.490692 2.247995 0.851214
O  0.784477 2.578205 -1.33843
O  -2.05212 -2.226571 1.414466
N  -1.84424 3.181721 2.990578
C  3.645475 1.371752 -0.8508
C  3.824459 2.826547 -0.550404
C  2.661686 2.06774 0.084186
C  3.221507 0.916231 -2.22885
C  4.553116 0.347634 -0.202297
C  4.908944 3.280966 0.403228
C  3.574002 3.867208 -1.618321
C  1.253686 2.323817 -0.26186
C  -0.907559 2.418696 0.672812
C  -1.570094 1.145876 0.203807
C  -1.422218 2.840551 1.978336
C  -1.514777 0.010825 1.001571
C  -2.193994 1.102393 -1.033592
C  -2.100814 -1.166749 0.563999
C  -2.784608 -0.078342 -1.457453
C  -2.745893 -1.215186 -0.668142
C  -2.019156 -3.499888 0.918919
C  -2.889737 -4.428387 1.468149
C  -1.109016 -3.877476 -0.060687
C  -2.845496 -5.745286 1.035281
C  -1.082362 -5.194208 -0.491274
C  -1.947958 -6.133081 0.052269
H  2.797474 1.836162 1.134852
H  2.54271 1.590881 -2.738431
H  4.10603 0.791678 -2.856588
H  2.726002 -0.054094 -2.167467
H  5.4878 0.258409 -0.759293
H  4.80535 0.580094 0.83016
H  4.075085 -0.633091 -0.203357
H  4.667123 4.266425 0.804156
H  5.049947 2.615299 1.252053
H  5.865701 3.363551 -0.11621
H  4.489066 4.024282 -2.192161
H  2.782636 3.615186 -2.315294
H  3.310174 4.821404 -1.159324
H  -1.112255 3.221964 -0.04218
H  -1.028813 0.031471 1.969825
H  -2.213432 1.979974 -1.665709
H  -3.282683 -0.116479 -2.416893
H  -3.216921 -2.128189 -1.008013
H  -3.589151 -4.117808 2.233024
H  -0.424398 -3.151217 -0.480179
H  -3.523411 -6.469435 1.467524
H  -0.372808 -5.488367 -1.253253
H  -1.919035 -7.15998 -0.285671
totalener: -1132.67539482 hartree
nucrepener: 2209.22729876 hartree
electener: -3341.90269358 hartree
oneelecener: -5926.99095588 hartree
twoeener: 2585.08826231 hartree
kineticenergy: 1127.72280086 hartree
xcener: -110.666069466741 hartree
chargesum: -0.0000000
charge: -0.268375 -0.394256 -0.294456 -0.003572 0.084541 0.079685 -0.119364 -0.273937 -0.255021 -0.253853 -0.277788 0.345348 0.335903 0.007071 -0.261702 -0.200705 -0.118578 0.197976 -0.115875 -0.149389 0.221959 -0.194018 -0.155498 -0.098776 -0.117995 -0.136581 0.076896 0.105248 0.089360 0.086301 0.092400 0.078346 0.089427 0.091363 0.078245 0.092398 0.089199 0.104501 0.088483 0.114975 0.122178 0.111762 0.128614 0.134443 0.128236 0.133806 0.127206 0.127030 0.126842
qa: -0.2684 -0.3943 -0.2945 -0.0036 0.0845 0.0797 -0.1194 -0.2739 -0.2550 -0.2539 -0.2778 0.3453 0.3359 0.0071 -0.2617 -0.2007 -0.1186 0.1980 -0.1159 -0.1494 0.2220 -0.1940 -0.1555 -0.0988 -0.1180 -0.1366 0.0769 0.1052 0.0894 0.0863 0.0924 0.0783 0.0894 0.0914 0.0782 0.0924 0.0892 0.1045 0.0885 0.1150 0.1222 0.1118 0.1286 0.1344 0.1282 0.1338 0.1272 0.1270 0.1268
va: 2.1323 2.1015 2.1101 3.1214 3.7224 3.7333 3.9393 3.9207 3.9077 3.9064 3.9233 4.1611 3.8308 3.6711 4.0245 4.0777 3.9919 3.8978 3.9720 3.9344 3.8235 4.0343 3.9476 3.9362 3.9463 3.9554 1.0334 1.0172 0.9991 1.0035 1.0011 1.0104 1.0063 1.0063 1.0104 1.0008 0.9992 1.0168 1.0035 1.0203 1.0293 1.0185 1.0013 1.0034 1.0125 1.0028 0.9988 1.0000 0.9999
dispcorr: -0.023392354 hartree
energy: -1132.698787170945
dipole: 30.01267 -29.03777 0.97490 3.01339 -4.06913 -1.05573 -13.18855 11.87272 -1.31582
magnitude: 1.94843 au
magnitude: 4.95252 debye
