program: Orca
programVersion: 5.0.2
elementType: O O O N C C C C C C C C C C C C C C C C C C C C C C H H H H H H H H H H H H H H H H H H H H H H H
charge: 0
multiplicity: 1
keywords: wb97x-d3
keywords: def2-TZVPP
keywords: def2/J RIJCOSX
keywords: DEFGRID2
keywords: scfconv7
keywords: smallprint printgap noloewdin
keywords: NOSOSCF
formula: C22H23NO3
InChI: InChI=1/C22H23NO3/c1-21(2)19(22(21,3)4)20(24)26-18(14-23)15-9-8-12-17(13-15)25-16-10-6-5-7-11-16/h5-13,18-19H,1-4H3
49 atoms
O  0.520777 2.262553 0.737892
O  0.842944 2.565778 -1.452006
O  -1.990577 -2.197562 1.479167
N  -1.853029 3.272811 2.805355
C  3.709642 1.410974 -0.925478
C  3.867164 2.863116 -0.599072
C  2.702512 2.08098 0.002591
C  3.314303 0.969707 -2.316732
C  4.616384 0.386715 -0.275698
C  4.93107 3.31381 0.379373
C  3.618264 3.920805 -1.650333
C  1.298293 2.327637 -0.365896
C  -0.876844 2.415007 0.53774
C  -1.521499 1.116547 0.117653
C  -1.410822 2.890194 1.816669
C  -1.471954 0.021385 0.968882
C  -2.124239 1.010995 -1.126755
C  -2.042636 -1.180782 0.578639
C  -2.700579 -0.192464 -1.502467
C  -2.669087 -1.290389 -0.659254
C  -2.056048 -3.4931 1.046349
C  -1.162623 -3.983947 0.102315
C  -3.009505 -4.322111 1.615408
C  -1.237672 -5.31477 -0.275526
C  -3.0672 -5.655461 1.236146
C  -2.188865 -6.154801 0.286669
H  2.821093 1.836096 1.052303
H  2.653338 1.653293 -2.837717
H  4.213164 0.842962 -2.923533
H  2.810132 0.002676 -2.275395
H  5.566122 0.322556 -0.810329
H  4.838395 0.59984 0.767866
H  4.15274 -0.60041 -0.310258
H  4.667969 4.286213 0.798484
H  5.072026 2.631657 1.215074
H  5.893063 3.42309 -0.125304
H  2.848493 3.666261 -2.370795
H  3.321988 4.858403 -1.176505
H  4.54212 4.111645 -2.199758
H  -1.079574 3.184585 -0.213849
H  -1.00266 0.091792 1.94293
H  -2.13818 1.85746 -1.800051
H  -3.182442 -0.280399 -2.46681
H  -3.130966 -2.219822 -0.964707
H  -0.414383 -3.332379 -0.330846
H  -3.693418 -3.922748 2.352718
H  -0.542799 -5.698115 -1.010973
H  -3.809569 -6.30356 1.682738
H  -2.240771 -7.193345 -0.010602
totalener: -1132.67540660 hartree
nucrepener: 2204.61424118 hartree
electener: -3337.28964778 hartree
oneelecener: -5917.78552226 hartree
twoeener: 2580.49587448 hartree
kineticenergy: 1127.72187734 hartree
xcener: -110.665828547707 hartree
chargesum: -0.0000000
charge: -0.268998 -0.394421 -0.293401 -0.004277 0.082535 0.077349 -0.112575 -0.272476 -0.256210 -0.253932 -0.277696 0.342465 0.335869 0.007236 -0.261040 -0.202684 -0.121752 0.207697 -0.118262 -0.154488 0.219482 -0.159931 -0.186912 -0.117216 -0.102356 -0.133632 0.076360 0.105336 0.088427 0.086714 0.092588 0.078425 0.089180 0.091745 0.078023 0.092324 0.104377 0.089159 0.089094 0.114860 0.121493 0.112646 0.128643 0.134254 0.133918 0.128776 0.127835 0.128043 0.127406
qa: -0.2690 -0.3944 -0.2934 -0.0043 0.0825 0.0773 -0.1126 -0.2725 -0.2562 -0.2539 -0.2777 0.3425 0.3359 0.0072 -0.2610 -0.2027 -0.1218 0.2077 -0.1183 -0.1545 0.2195 -0.1599 -0.1869 -0.1172 -0.1024 -0.1336 0.0764 0.1053 0.0884 0.0867 0.0926 0.0784 0.0892 0.0917 0.0780 0.0923 0.1044 0.0892 0.0891 0.1149 0.1215 0.1126 0.1286 0.1343 0.1339 0.1288 0.1278 0.1280 0.1274
va: 2.1316 2.1003 2.1121 3.1213 3.7234 3.7377 3.9299 3.9196 3.9086 3.9064 3.9235 4.1665 3.8280 3.6796 4.0259 4.0822 3.9921 3.8918 3.9769 3.9291 3.8237 3.9594 4.0343 3.9431 3.9365 3.9528 1.0334 1.0173 0.9990 1.0034 1.0011 1.0104 1.0062 1.0061 1.0104 1.0009 1.0165 1.0031 0.9994 1.0213 1.0296 1.0183 1.0014 1.0044 1.0026 1.0120 0.9998 0.9988 0.9999
dispcorr: -0.023338827 hartree
energy: -1132.698745427854
dipole: 29.99308 -29.03841 0.95467 3.05775 -4.22159 -1.16385 -12.93588 11.69020 -1.24568
magnitude: 1.95388 au
magnitude: 4.96637 debye
