program: Orca
programVersion: 5.0.2
elementType: O O O N C C C C C C C C C C C C C C C C C C C C C C H H H H H H H H H H H H H H H H H H H H H H H
charge: 0
multiplicity: 1
keywords: wb97x-d3
keywords: def2-TZVPP
keywords: def2/J RIJCOSX
keywords: DEFGRID2
keywords: scfconv7
keywords: smallprint printgap noloewdin
keywords: NOSOSCF
formula: C22H23NO3
InChI: InChI=1/C22H23NO3/c1-21(2)19(22(21,3)4)20(24)26-18(14-23)15-9-8-12-17(13-15)25-16-10-6-5-7-11-16/h5-13,18-19H,1-4H3
49 atoms
O  0.233215 2.621957 0.210057
O  1.236904 1.507791 -1.448163
O  -2.006605 -2.330783 -1.025555
N  -2.537672 4.417088 0.183452
C  3.757783 1.552761 0.411226
C  3.848619 2.858217 -0.313748
C  2.531871 2.457657 0.34618
C  3.798393 0.244875 -0.346638
C  4.389728 1.401462 1.779009
C  4.566893 4.030127 0.320396
C  3.980346 2.895668 -1.819402
C  1.319038 2.121667 -0.417857
C  -1.033261 2.356637 -0.381406
C  -1.617562 1.066759 0.140569
C  -1.871744 3.512514 -0.05507
C  -1.557314 -0.069344 -0.651297
C  -2.15811 1.000531 1.41979
C  -2.056536 -1.274483 -0.172013
C  -2.651199 -0.205143 1.886534
C  -2.609997 -1.346982 1.099966
C  -1.977633 -3.605991 -0.533084
C  -2.907329 -4.511114 -1.019799
C  -1.015231 -4.005027 0.385826
C  -2.870811 -5.82758 -0.584066
C  -0.99655 -5.320139 0.821269
C  -1.922527 -6.235835 0.341114
H  2.310372 2.987578 1.266012
H  3.354299 0.279791 -1.335151
H  4.836246 -0.075876 -0.456208
H  3.275153 -0.530973 0.214805
H  5.457739 1.195006 1.685997
H  4.276862 2.279052 2.412076
H  3.937842 0.562285 2.3102
H  5.641341 3.965124 0.138178
H  4.215548 4.966479 -0.115791
H  4.418524 4.102573 1.395683
H  5.034864 2.824476 -2.092924
H  3.447704 2.10618 -2.338225
H  3.608101 3.8461 -2.205772
H  -0.945717 2.30866 -1.470913
H  -1.119698 -0.032164 -1.640537
H  -2.210343 1.884331 2.042568
H  -3.085476 -0.260984 2.875608
H  -3.01291 -2.277841 1.476515
H  -3.646679 -4.18327 -1.73856
H  -0.284972 -3.29526 0.753177
H  -3.594975 -6.534439 -0.966917
H  -0.246706 -5.631742 1.536258
H  -1.900454 -7.261627 0.683053
totalener: -1132.67601056 hartree
nucrepener: 2202.46741400 hartree
electener: -3335.14342456 hartree
oneelecener: -5913.47335726 hartree
twoeener: 2578.32993270 hartree
kineticenergy: 1127.72571015 hartree
xcener: -110.667000839815 hartree
chargesum: -0.0000000
charge: -0.262191 -0.404257 -0.294335 -0.006677 0.082189 0.083648 -0.127418 -0.274195 -0.256185 -0.255263 -0.276465 0.366520 0.318685 -0.003865 -0.254335 -0.153160 -0.165710 0.204979 -0.122539 -0.148979 0.221909 -0.188788 -0.158026 -0.101298 -0.116293 -0.134151 0.075643 0.105220 0.088792 0.086698 0.092887 0.078557 0.088886 0.092598 0.091829 0.077314 0.089742 0.105014 0.087673 0.117215 0.120539 0.120868 0.130000 0.133460 0.126793 0.134791 0.126995 0.127541 0.127146
qa: -0.2622 -0.4043 -0.2943 -0.0067 0.0822 0.0836 -0.1274 -0.2742 -0.2562 -0.2553 -0.2765 0.3665 0.3187 -0.0039 -0.2543 -0.1532 -0.1657 0.2050 -0.1225 -0.1490 0.2219 -0.1888 -0.1580 -0.1013 -0.1163 -0.1342 0.0756 0.1052 0.0888 0.0867 0.0929 0.0786 0.0889 0.0926 0.0918 0.0773 0.0897 0.1050 0.0877 0.1172 0.1205 0.1209 0.1300 0.1335 0.1268 0.1348 0.1270 0.1275 0.1271
va: 2.1294 2.0860 2.1100 3.1189 3.7236 3.7266 3.9417 3.9225 3.9067 3.9070 3.9220 4.1471 3.8242 3.7021 4.0204 4.0253 4.0408 3.9036 3.9715 3.9350 3.8237 4.0352 3.9574 3.9370 3.9410 3.9533 1.0339 1.0172 0.9992 1.0033 1.0008 1.0105 1.0061 1.0010 1.0060 1.0103 0.9992 1.0167 1.0034 1.0239 1.0342 1.0164 1.0014 1.0046 1.0125 1.0024 0.9991 0.9999 0.9999
dispcorr: -0.023269638 hartree
energy: -1132.699280195501
dipole: 31.57788 -30.43203 1.14585 2.39476 -3.77454 -1.37978 3.95343 -3.31608 0.63735
magnitude: 1.90342 au
magnitude: 4.83810 debye
