program: Orca
programVersion: 5.0.2
elementType: O O O N C C C C C C C C C C C C C C C C C C C C C C H H H H H H H H H H H H H H H H H H H H H H H
charge: 0
multiplicity: 1
keywords: wb97x-d3
keywords: def2-TZVPP
keywords: def2/J RIJCOSX
keywords: DEFGRID2
keywords: scfconv7
keywords: smallprint printgap noloewdin
keywords: NOSOSCF
formula: C22H23NO3
InChI: InChI=1/C22H23NO3/c1-21(2)19(22(21,3)4)20(24)26-18(14-23)15-9-8-12-17(13-15)25-16-10-6-5-7-11-16/h5-13,18-19H,1-4H3
49 atoms
O  0.136261 2.386492 -0.491705
O  1.149054 0.409868 -0.722333
O  -2.756759 -2.503577 0.619761
N  -2.569866 3.790718 -1.784502
C  3.228992 1.631072 1.313364
C  3.780769 1.973533 -0.035203
C  2.316549 2.269908 0.268343
C  3.040587 0.187773 1.723106
C  3.556771 2.494015 2.513597
C  4.671247 3.186346 -0.20481
C  4.169801 0.882032 -1.007163
C  1.192574 1.554381 -0.358365
C  -1.055753 1.808899 -1.005807
C  -1.761187 0.970457 0.033173
C  -1.889999 2.933916 -1.434349
C  -1.936178 -0.384389 -0.196188
C  -2.191165 1.549155 1.220425
C  -2.531145 -1.174179 0.779835
C  -2.797296 0.754778 2.17921
C  -2.962569 -0.604749 1.969954
C  -1.93098 -3.273245 -0.150641
C  -2.532993 -4.246088 -0.935116
C  -0.54739 -3.146217 -0.120558
C  -1.745091 -5.099149 -1.691949
C  0.226546 -3.998617 -0.892688
C  -0.36375 -4.977838 -1.678211
H  2.095826 3.316271 0.448172
H  3.96239 -0.184707 2.174042
H  2.254889 0.11058 2.476672
H  2.774111 -0.480034 0.910929
H  4.517653 2.203174 2.94264
H  3.605196 3.556719 2.285886
H  2.798672 2.36506 3.287698
H  4.36579 4.039523 0.397287
H  5.702236 2.944979 0.06113
H  4.668256 3.510957 -1.246396
H  4.118741 1.254265 -2.03167
H  5.203513 0.584313 -0.820653
H  3.552013 -0.007634 -0.958137
H  -0.840511 1.198733 -1.889116
H  -1.590513 -0.82247 -1.123498
H  -2.060059 2.609405 1.394918
H  -3.140503 1.195287 3.10554
H  -3.42758 -1.229763 2.720799
H  -3.611652 -4.331136 -0.944131
H  -0.072358 -2.38638 0.486669
H  -2.217958 -5.858153 -2.301026
H  1.303137 -3.894074 -0.873585
H  0.248263 -5.640468 -2.274856
totalener: -1132.67521344 hartree
nucrepener: 2264.00694470 hartree
electener: -3396.68215814 hartree
oneelecener: -6036.53101874 hartree
twoeener: 2639.84886060 hartree
kineticenergy: 1127.72424234 hartree
xcener: -110.667556776132 hartree
chargesum: -0.0000000
charge: -0.263226 -0.399125 -0.296194 -0.002946 0.080963 0.085534 -0.121016 -0.272604 -0.255142 -0.255409 -0.273635 0.349225 0.319365 0.020801 -0.254544 -0.156808 -0.197213 0.251902 -0.085226 -0.207024 0.268656 -0.221205 -0.180606 -0.085501 -0.103711 -0.148348 0.077815 0.092693 0.090557 0.093549 0.092899 0.078194 0.090827 0.078212 0.092377 0.091219 0.088209 0.088811 0.102848 0.113150 0.120434 0.121917 0.127999 0.127874 0.125092 0.132527 0.125821 0.125476 0.124536
qa: -0.2632 -0.3991 -0.2962 -0.0029 0.0810 0.0855 -0.1210 -0.2726 -0.2551 -0.2554 -0.2736 0.3492 0.3194 0.0208 -0.2545 -0.1568 -0.1972 0.2519 -0.0852 -0.2070 0.2687 -0.2212 -0.1806 -0.0855 -0.1037 -0.1483 0.0778 0.0927 0.0906 0.0935 0.0929 0.0782 0.0908 0.0782 0.0924 0.0912 0.0882 0.0888 0.1028 0.1132 0.1204 0.1219 0.1280 0.1279 0.1251 0.1325 0.1258 0.1255 0.1245
va: 2.1362 2.0939 2.1227 3.1219 3.7344 3.7263 3.9406 3.9286 3.9061 3.9056 3.9207 4.1545 3.8513 3.6354 4.0157 3.9317 4.0422 3.8616 3.9337 4.0412 3.7890 4.0480 3.9530 3.9274 3.9428 3.9671 1.0331 1.0005 1.0026 1.0144 1.0011 1.0104 1.0059 1.0101 1.0011 1.0061 1.0037 0.9989 1.0170 1.0213 1.0167 1.0173 0.9993 1.0125 1.0146 1.0040 0.9988 0.9999 1.0007
dispcorr: -0.024597539 hartree
energy: -1132.699810978988
dipole: 32.16843 -30.72013 1.44830 3.49987 -4.17313 -0.67326 7.62169 -6.85148 0.77021
magnitude: 1.77315 au
magnitude: 4.50699 debye
