program: Orca
programVersion: 5.0.2
elementType: O O O N C C C C C C C C C C C C C C C C C C C C C C H H H H H H H H H H H H H H H H H H H H H H H
charge: 0
multiplicity: 1
keywords: wb97x-d3
keywords: def2-TZVPP
keywords: def2/J RIJCOSX
keywords: DEFGRID2
keywords: scfconv7
keywords: smallprint printgap noloewdin
keywords: NOSOSCF
formula: C22H23NO3
InChI: InChI=1/C22H23NO3/c1-21(2)19(22(21,3)4)20(24)26-18(14-23)15-9-8-12-17(13-15)25-16-10-6-5-7-11-16/h5-13,18-19H,1-4H3
49 atoms
O  0.689257 1.375556 0.52901
O  0.684195 3.105553 -0.888462
O  -2.440169 -2.791377 -0.783777
N  -1.169926 0.926044 3.239774
C  3.511775 2.10373 -1.754838
C  3.815769 2.913301 -0.532819
C  2.70679 1.864866 -0.483762
C  2.882033 2.748105 -2.969344
C  4.433436 0.974132 -2.166023
C  5.045371 2.609827 0.295818
C  3.482081 4.38721 -0.483289
C  1.283611 2.21547 -0.346553
C  -0.704223 1.556381 0.746715
C  -1.519965 0.708845 -0.198384
C  -0.94861 1.196761 2.145838
C  -1.590191 -0.666788 -0.005786
C  -2.15783 1.305504 -1.27506
C  -2.328304 -1.442646 -0.887599
C  -2.883086 0.51615 -2.156896
C  -2.976399 -0.8498 -1.967343
C  -2.206963 -3.411089 0.414962
C  -1.244611 -4.406867 0.455573
C  -2.947999 -3.092586 1.545503
C  -1.026823 -5.096511 1.639534
C  -2.712068 -3.779887 2.725089
C  -1.753756 -4.782848 2.777452
H  2.966885 0.961657 0.057345
H  3.669733 3.128645 -3.622641
H  2.316839 2.007677 -3.537884
H  2.206437 3.566848 -2.749285
H  5.280557 1.359478 -2.736925
H  4.830822 0.406223 -1.327166
H  3.89919 0.26999 -2.806033
H  5.274097 1.54844 0.364442
H  5.920914 3.110883 -0.121891
H  4.912054 2.976826 1.314752
H  2.580195 4.663068 -1.019239
H  3.355032 4.708802 0.55204
H  4.309659 4.962492 -0.90277
H  -0.978066 2.60832 0.622774
H  -1.082637 -1.124177 0.835177
H  -2.082908 2.373531 -1.429362
H  -3.387233 0.972426 -2.998314
H  -3.548497 -1.467637 -2.646981
H  -0.67984 -4.641302 -0.437158
H  -3.700427 -2.314982 1.505308
H  -0.278798 -5.877819 1.671117
H  -3.284343 -3.529341 3.60824
H  -1.57698 -5.317003 3.701072
totalener: -1132.67612689 hartree
nucrepener: 2221.48889650 hartree
electener: -3354.16502338 hartree
oneelecener: -5951.75793792 hartree
twoeener: 2597.59291454 hartree
kineticenergy: 1127.71888722 hartree
xcener: -110.665781137601 hartree
chargesum: -0.0000000
charge: -0.267524 -0.402534 -0.295928 -0.007509 0.083042 0.077930 -0.120785 -0.271718 -0.256998 -0.254603 -0.278774 0.360503 0.335578 -0.004721 -0.263496 -0.179694 -0.140665 0.225824 -0.089755 -0.204558 0.230321 -0.192499 -0.163740 -0.101105 -0.102194 -0.134231 0.075643 0.087619 0.088709 0.103667 0.092473 0.077673 0.090826 0.077737 0.091977 0.092098 0.104292 0.089195 0.090265 0.117112 0.125694 0.120634 0.126779 0.127295 0.124889 0.133298 0.125908 0.129144 0.126907
qa: -0.2675 -0.4025 -0.2959 -0.0075 0.0830 0.0779 -0.1208 -0.2717 -0.2570 -0.2546 -0.2788 0.3605 0.3356 -0.0047 -0.2635 -0.1797 -0.1407 0.2258 -0.0898 -0.2046 0.2303 -0.1925 -0.1637 -0.1011 -0.1022 -0.1342 0.0756 0.0876 0.0887 0.1037 0.0925 0.0777 0.0908 0.0777 0.0920 0.0921 0.1043 0.0892 0.0903 0.1171 0.1257 0.1206 0.1268 0.1273 0.1249 0.1333 0.1259 0.1291 0.1269
va: 2.1314 2.0895 2.1158 3.1183 3.7244 3.7348 3.9346 3.9194 3.9076 3.9058 3.9237 4.1575 3.8185 3.7107 4.0286 3.9805 3.9796 3.8584 3.9557 4.0330 3.8131 4.0412 3.9784 3.9349 3.9485 3.9574 1.0336 0.9991 1.0033 1.0173 1.0011 1.0104 1.0058 1.0103 1.0010 1.0059 1.0169 1.0028 0.9994 1.0256 1.0185 1.0203 0.9997 1.0126 1.0126 1.0033 0.9993 0.9998 1.0002
dispcorr: -0.023597797 hartree
energy: -1132.699724682768
dipole: 29.01108 -28.19218 0.81889 12.80554 -12.97852 -0.17298 -10.43113 9.46469 -0.96644
magnitude: 1.27848 au
magnitude: 3.24965 debye
