program: Orca
programVersion: 5.0.2
elementType: O O O N C C C C C C C C C C C C C C C C C C C C C C H H H H H H H H H H H H H H H H H H H H H H H
charge: 0
multiplicity: 1
keywords: wb97x-d3
keywords: def2-TZVPP
keywords: def2/J RIJCOSX
keywords: DEFGRID2
keywords: scfconv7
keywords: smallprint printgap noloewdin
keywords: NOSOSCF
formula: C22H23NO3
InChI: InChI=1/C22H23NO3/c1-21(2)19(22(21,3)4)20(24)26-18(14-23)15-9-8-12-17(13-15)25-16-10-6-5-7-11-16/h5-13,18-19H,1-4H3
49 atoms
O  0.906219 1.84337 0.450177
O  0.915767 2.937861 -1.503025
O  -1.534543 -2.847065 1.25749
N  -1.265925 2.369084 2.895349
C  3.976717 2.344846 -1.581137
C  3.913796 3.522157 -0.657851
C  2.982567 2.332739 -0.428263
C  3.515423 2.462341 -3.016796
C  5.118358 1.356254 -1.467245
C  4.985888 3.729844 0.390333
C  3.362044 4.845967 -1.135099
C  1.523654 2.426256 -0.60082
C  -0.516158 1.828284 0.451078
C  -1.028617 0.493556 -0.028941
C  -0.928757 2.125822 1.824661
C  -1.104259 -0.587651 0.837377
C  -1.377678 0.344273 -1.365203
C  -1.527656 -1.821023 0.365953
C  -1.79762 -0.894033 -1.82527
C  -1.874562 -1.981769 -0.971128
C  -2.488891 -3.821347 1.168197
C  -2.073513 -5.139544 1.280351
C  -3.836417 -3.512289 1.028845
C  -3.016773 -6.155782 1.257775
C  -4.767104 -4.538507 0.997565
C  -4.364096 -5.86188 1.111065
H  3.26272 1.702952 0.408845
H  2.696348 3.15474 -3.175338
H  4.3533 2.784964 -3.638064
H  3.190944 1.488746 -3.387856
H  4.836534 0.405177 -1.921897
H  5.999128 1.725381 -1.996451
H  5.413204 1.145279 -0.441288
H  5.843775 4.251773 -0.038346
H  4.600682 4.345029 1.204953
H  5.349407 2.804287 0.831849
H  4.161272 5.428698 -1.596704
H  2.552936 4.76392 -1.853443
H  2.98664 5.422883 -0.287971
H  -0.906147 2.623373 -0.190847
H  -0.846666 -0.485625 1.884746
H  -1.312241 1.18596 -2.041812
H  -2.066159 -1.017696 -2.865841
H  -2.200523 -2.944106 -1.343668
H  -1.020047 -5.360536 1.391802
H  -4.157544 -2.480882 0.95424
H  -2.692205 -7.184073 1.349274
H  -5.816984 -4.298308 0.892433
H  -5.096206 -6.657604 1.090479
totalener: -1132.67577602 hartree
nucrepener: 2168.69364131 hartree
electener: -3301.36941733 hartree
oneelecener: -5845.97229231 hartree
twoeener: 2544.60287498 hartree
kineticenergy: 1127.72012347 hartree
xcener: -110.665569053941 hartree
chargesum: -0.0000000
charge: -0.264155 -0.402071 -0.296008 -0.006537 0.088841 0.078958 -0.131452 -0.271327 -0.257166 -0.255201 -0.279628 0.365576 0.327536 0.006759 -0.259032 -0.192585 -0.140013 0.182660 -0.116046 -0.142821 0.218052 -0.195805 -0.146157 -0.098667 -0.118956 -0.137044 0.075676 0.103660 0.087353 0.087173 0.090722 0.092144 0.077666 0.092350 0.093081 0.077688 0.090983 0.103037 0.090917 0.120927 0.121588 0.128449 0.130396 0.134601 0.126917 0.135326 0.126443 0.128532 0.126658
qa: -0.2642 -0.4021 -0.2960 -0.0065 0.0888 0.0790 -0.1315 -0.2713 -0.2572 -0.2552 -0.2796 0.3656 0.3275 0.0068 -0.2590 -0.1926 -0.1400 0.1827 -0.1160 -0.1428 0.2181 -0.1958 -0.1462 -0.0987 -0.1190 -0.1370 0.0757 0.1037 0.0874 0.0872 0.0907 0.0921 0.0777 0.0923 0.0931 0.0777 0.0910 0.1030 0.0909 0.1209 0.1216 0.1284 0.1304 0.1346 0.1269 0.1353 0.1264 0.1285 0.1267
va: 2.1226 2.0903 2.1051 3.1163 3.7140 3.7385 3.9375 3.9168 3.9091 3.9055 3.9245 4.1539 3.7966 3.7371 4.0283 4.1116 3.9631 3.9191 3.9613 3.9408 3.8217 4.0322 3.9413 3.9405 3.9455 3.9533 1.0340 1.0174 0.9990 1.0037 1.0059 1.0011 1.0105 1.0008 1.0060 1.0102 0.9996 1.0164 1.0027 1.0281 1.0302 1.0187 1.0011 1.0037 1.0128 1.0024 0.9988 0.9997 1.0001
dispcorr: -0.022994700 hartree
energy: -1132.698770724978
dipole: 27.30773 -26.66205 0.64569 12.11961 -12.93397 -0.81435 -13.87214 12.57253 -1.29960
magnitude: 1.66405 au
magnitude: 4.22967 debye
