program: Orca
programVersion: 5.0.2
elementType: O O O N C C C C C C C C C C C C C C C C C C C C C C H H H H H H H H H H H H H H H H H H H H H H H
charge: 0
multiplicity: 1
keywords: wb97x-d3
keywords: def2-TZVPP
keywords: def2/J RIJCOSX
keywords: DEFGRID2
keywords: scfconv7
keywords: smallprint printgap noloewdin
keywords: NOSOSCF
formula: C22H23NO3
InChI: InChI=1/C22H23NO3/c1-21(2)19(22(21,3)4)20(24)26-18(14-23)15-9-8-12-17(13-15)25-16-10-6-5-7-11-16/h5-13,18-19H,1-4H3
49 atoms
O  0.259277 2.110956 -0.940835
O  1.791239 0.600581 -0.3407
O  -2.141645 -2.638714 1.630682
N  -2.367598 1.992932 -2.95468
C  3.208239 3.038467 1.057685
C  3.754426 3.068194 -0.334872
C  2.247255 2.958357 -0.124673
C  3.441467 1.840891 1.950603
C  3.139292 4.313008 1.873155
C  4.240405 4.372606 -0.930776
C  4.546336 1.899397 -0.875543
C  1.469845 1.751993 -0.452801
C  -0.631152 1.05128 -1.243409
C  -1.340379 0.534294 -0.01333
C  -1.59676 1.598377 -2.200341
C  -1.390977 -0.831619 0.215062
C  -1.939504 1.423132 0.869126
C  -2.06714 -1.31654 1.328528
C  -2.589965 0.928166 1.987502
C  -2.663727 -0.435112 2.220111
C  -2.029215 -3.568261 0.632125
C  -2.910036 -3.57491 -0.441903
C  -1.043111 -4.534905 0.745791
C  -2.792107 -4.5604 -1.40876
C  -0.941691 -5.521804 -0.224199
C  -1.809954 -5.535896 -1.304724
H  1.699095 3.872979 -0.321944
H  3.477432 0.889864 1.430885
H  4.384906 1.967808 2.485308
H  2.649913 1.769688 2.698427
H  4.104536 4.52308 2.338218
H  2.855411 5.188153 1.292319
H  2.405547 4.206645 2.673736
H  3.633029 5.231852 -0.653843
H  5.265909 4.577465 -0.616936
H  4.236047 4.31356 -2.020241
H  4.222095 0.929962 -0.513655
H  4.484586 1.875828 -1.964882
H  5.598769 2.021679 -0.612124
H  -0.103171 0.227991 -1.73581
H  -0.894559 -1.511203 -0.466209
H  -1.903822 2.489101 0.686685
H  -3.058969 1.611021 2.683102
H  -3.179189 -0.823695 3.088428
H  -3.681645 -2.819285 -0.519419
H  -0.367564 -4.513798 1.590706
H  -3.477362 -4.567554 -2.245887
H  -0.173694 -6.278566 -0.135053
H  -1.724689 -6.303806 -2.061463
totalener: -1132.67529274 hartree
nucrepener: 2218.11287120 hartree
electener: -3350.78816394 hartree
oneelecener: -5944.86746101 hartree
twoeener: 2594.07929707 hartree
kineticenergy: 1127.72472011 hartree
xcener: -110.666282212715 hartree
chargesum: -0.0000000
charge: -0.272588 -0.386140 -0.296288 -0.003770 0.083180 0.083795 -0.120369 -0.271792 -0.256189 -0.254753 -0.276196 0.333769 0.311169 0.025300 -0.250667 -0.115426 -0.197484 0.207983 -0.092682 -0.191014 0.214472 -0.156995 -0.182936 -0.116899 -0.102405 -0.132115 0.076765 0.104369 0.088456 0.088650 0.092927 0.077879 0.089784 0.077939 0.092754 0.091207 0.104627 0.087747 0.088825 0.115413 0.112547 0.123714 0.127522 0.128052 0.136562 0.126759 0.130244 0.127083 0.127215
qa: -0.2726 -0.3861 -0.2963 -0.0038 0.0832 0.0838 -0.1204 -0.2718 -0.2562 -0.2548 -0.2762 0.3338 0.3112 0.0253 -0.2507 -0.1154 -0.1975 0.2080 -0.0927 -0.1910 0.2145 -0.1570 -0.1829 -0.1169 -0.1024 -0.1321 0.0768 0.1044 0.0885 0.0886 0.0929 0.0779 0.0898 0.0779 0.0928 0.0912 0.1046 0.0877 0.0888 0.1154 0.1125 0.1237 0.1275 0.1281 0.1366 0.1268 0.1302 0.1271 0.1272
va: 2.1214 2.1112 2.1118 3.1241 3.7264 3.7349 3.9352 3.9224 3.9075 3.9054 3.9221 4.1725 3.8527 3.6815 4.0184 3.9340 4.0266 3.8746 3.9498 4.0278 3.8329 3.9712 4.0343 3.9455 3.9351 3.9520 1.0333 1.0171 0.9991 1.0032 1.0012 1.0101 1.0063 1.0100 1.0010 1.0063 1.0173 1.0033 0.9991 1.0257 1.0188 1.0183 0.9992 1.0119 1.0024 1.0123 0.9993 0.9992 1.0000
dispcorr: -0.023561315 hartree
energy: -1132.698854051705
dipole: 28.57428 -27.51794 1.05634 15.56463 -15.62466 -0.06003 5.95174 -5.08489 0.86685
magnitude: 1.36780 au
magnitude: 3.47668 debye
