program: Orca
programVersion: 5.0.2
elementType: O O O N C C C C C C C C C C C C C C C C C C C C C C H H H H H H H H H H H H H H H H H H H H H H H
charge: 0
multiplicity: 1
keywords: wb97x-d3
keywords: def2-TZVPP
keywords: def2/J RIJCOSX
keywords: DEFGRID2
keywords: scfconv7
keywords: smallprint printgap noloewdin
keywords: NOSOSCF
formula: C22H23NO3
InChI: InChI=1/C22H23NO3/c1-21(2)19(22(21,3)4)20(24)26-18(14-23)15-9-8-12-17(13-15)25-16-10-6-5-7-11-16/h5-13,18-19H,1-4H3
49 atoms
O  0.745843 1.664804 0.050973
O  1.084591 3.52809 -1.142747
O  -1.248715 -2.894131 0.749293
N  -1.469125 2.728554 2.331102
C  3.97781 2.339751 -1.527934
C  4.087174 3.194339 -0.304826
C  2.946327 2.188257 -0.411526
C  3.591434 2.945463 -2.858259
C  4.911719 1.163855 -1.721981
C  5.132603 2.884324 0.746125
C  3.824186 4.681688 -0.377667
C  1.535326 2.576537 -0.566258
C  -0.656504 1.856385 0.001731
C  -1.33231 0.551916 -0.338659
C  -1.101273 2.348514 1.311349
C  -1.01801 -0.598289 0.372846
C  -2.278978 0.511172 -1.350453
C  -1.645077 -1.79281 0.058188
C  -2.906456 -0.688969 -1.652624
C  -2.594224 -1.844669 -0.959116
C  -2.149105 -3.872914 1.061418
C  -3.412393 -3.579767 1.559441
C  -1.733468 -5.188237 0.920566
C  -4.259988 -4.618666 1.910273
C  -2.587968 -6.216962 1.28591
C  -3.854823 -5.938868 1.776264
H  3.070624 1.298359 0.195322
H  3.129176 2.189475 -3.495197
H  2.898864 3.77724 -2.790595
H  4.488694 3.29741 -3.370643
H  5.86073 1.494719 -2.148398
H  5.132958 0.626645 -0.802117
H  4.47258 0.445743 -2.416208
H  6.095107 3.318196 0.468557
H  4.840748 3.318117 1.703685
H  5.285379 1.819504 0.909899
H  4.747634 5.198029 -0.64696
H  3.059979 4.971418 -1.090081
H  3.51351 5.056609 0.598826
H  -0.916086 2.615983 -0.741444
H  -0.286591 -0.579531 1.170968
H  -2.525041 1.407568 -1.905185
H  -3.640243 -0.727654 -2.446371
H  -3.080074 -2.778088 -1.211309
H  -3.729977 -2.552183 1.681727
H  -0.744067 -5.396675 0.535318
H  -5.242824 -4.390307 2.300752
H  -2.260062 -7.242427 1.17934
H  -4.520136 -6.743924 2.056535
totalener: -1132.67488265 hartree
nucrepener: 2160.78891652 hartree
electener: -3293.46379916 hartree
oneelecener: -5830.11258242 hartree
twoeener: 2536.64878325 hartree
kineticenergy: 1127.72774881 hartree
xcener: -110.666828305948 hartree
chargesum: -0.0000000
charge: -0.282030 -0.390839 -0.296939 -0.002375 0.084127 0.088616 -0.143599 -0.277897 -0.255436 -0.255289 -0.275348 0.363536 0.334801 0.042797 -0.272356 -0.203518 -0.144512 0.201308 -0.108486 -0.156415 0.233435 -0.159489 -0.204730 -0.117120 -0.094276 -0.140820 0.075420 0.087740 0.104656 0.089364 0.092632 0.078039 0.090405 0.092135 0.093045 0.076558 0.088255 0.105383 0.090538 0.117486 0.122840 0.115575 0.129918 0.136523 0.138026 0.125849 0.129329 0.126274 0.126861
qa: -0.2820 -0.3908 -0.2969 -0.0024 0.0841 0.0886 -0.1436 -0.2779 -0.2554 -0.2553 -0.2753 0.3635 0.3348 0.0428 -0.2724 -0.2035 -0.1445 0.2013 -0.1085 -0.1564 0.2334 -0.1595 -0.2047 -0.1171 -0.0943 -0.1408 0.0754 0.0877 0.1047 0.0894 0.0926 0.0780 0.0904 0.0921 0.0930 0.0766 0.0883 0.1054 0.0905 0.1175 0.1228 0.1156 0.1299 0.1365 0.1380 0.1258 0.1293 0.1263 0.1269
va: 2.1351 2.1074 2.1085 3.1224 3.7215 3.7203 3.9425 3.9255 3.9069 3.9072 3.9204 4.1639 3.7728 3.7648 4.0475 4.0958 3.9859 3.8899 3.9653 3.9505 3.8110 3.9418 4.0361 3.9464 3.9369 3.9596 1.0308 1.0029 1.0168 0.9995 1.0011 1.0102 1.0060 1.0010 1.0061 1.0100 0.9986 1.0169 1.0036 1.0448 1.0313 1.0101 1.0015 1.0022 1.0022 1.0135 0.9996 0.9989 1.0001
dispcorr: -0.022528494 hartree
energy: -1132.697411141384
dipole: 27.79895 -27.26684 0.53211 9.81326 -11.03112 -1.21786 -9.87088 8.72087 -1.15001
magnitude: 1.75751 au
magnitude: 4.46724 debye
