program: Orca
programVersion: 5.0.2
elementType: O O O N C C C C C C C C C C C C C C C C C C C C C C H H H H H H H H H H H H H H H H H H H H H H H
charge: 0
multiplicity: 1
keywords: wb97x-d3
keywords: def2-TZVPP
keywords: def2/J RIJCOSX
keywords: DEFGRID2
keywords: scfconv7
keywords: smallprint printgap noloewdin
keywords: NOSOSCF
formula: C22H23NO3
InChI: InChI=1/C22H23NO3/c1-21(2)19(22(21,3)4)20(24)26-18(14-23)15-9-8-12-17(13-15)25-16-10-6-5-7-11-16/h5-13,18-19H,1-4H3
49 atoms
O  0.358157 2.539887 0.234116
O  1.333848 1.509547 -1.495091
O  -1.317302 -2.636632 -0.609487
N  -2.546085 4.117372 0.343148
C  3.959104 1.772811 0.203421
C  3.903969 3.061468 -0.554791
C  2.666344 2.582803 0.198633
C  4.052161 0.453695 -0.52962
C  4.684184 1.70409 1.531061
C  4.570777 4.300425 0.003846
C  3.941173 3.065538 -2.066462
C  1.435579 2.134754 -0.473082
C  -0.921259 2.1624 -0.26149
C  -1.368038 0.850575 0.337187
C  -1.82476 3.261492 0.086102
C  -1.195624 -0.313463 -0.396499
C  -1.902452 0.797015 1.619591
C  -1.555411 -1.537521 0.153836
C  -2.258321 -0.428093 2.156275
C  -2.08679 -1.600461 1.4360
C  -2.050473 -3.773881 -0.409263
C  -1.367106 -4.955475 -0.171107
C  -3.436821 -3.760606 -0.493609
C  -2.079661 -6.135971 -0.019128
C  -4.137411 -4.944703 -0.329579
C  -3.464092 -6.134825 -0.091198
H  2.465554 3.117206 1.12058
H  3.646974 -0.349477 0.088307
H  3.526072 0.425941 -1.477461
H  5.101528 0.221083 -0.721319
H  4.551592 2.591542 2.146414
H  4.323218 0.853674 2.111746
H  5.755963 1.565553 1.375356
H  4.123574 5.196075 -0.430168
H  4.486438 4.391602 1.084771
H  5.633359 4.308976 -0.246882
H  4.980252 3.070205 -2.401342
H  3.444965 2.221323 -2.532761
H  3.470725 3.971907 -2.451462
H  -0.900781 2.082736 -1.352542
H  -0.771475 -0.283086 -1.39189
H  -2.051495 1.702604 2.193403
H  -2.674235 -0.476909 3.153696
H  -2.364644 -2.549738 1.87427
H  -0.286771 -4.945427 -0.113782
H  -3.962435 -2.834486 -0.689508
H  -1.546501 -7.059734 0.162709
H  -5.217266 -4.936481 -0.395984
H  -4.01651 -7.056441 0.032068
totalener: -1132.67597177 hartree
nucrepener: 2189.24760170 hartree
electener: -3321.92357347 hartree
oneelecener: -5887.11117261 hartree
twoeener: 2565.18759913 hartree
kineticenergy: 1127.72071152 hartree
xcener: -110.665914347672 hartree
chargesum: -0.0000000
charge: -0.262475 -0.405682 -0.293466 -0.007530 0.085012 0.082604 -0.132391 -0.276049 -0.255236 -0.254035 -0.275231 0.372238 0.320156 -0.002324 -0.253410 -0.157604 -0.164365 0.198032 -0.122437 -0.149133 0.215612 -0.187171 -0.152897 -0.103635 -0.119003 -0.131446 0.075657 0.088349 0.105093 0.088881 0.077667 0.090655 0.092092 0.091088 0.077106 0.092138 0.088976 0.104398 0.087961 0.117510 0.123753 0.120412 0.129989 0.133621 0.126851 0.135855 0.127090 0.129372 0.127351
qa: -0.2625 -0.4057 -0.2935 -0.0075 0.0850 0.0826 -0.1324 -0.2760 -0.2552 -0.2540 -0.2752 0.3722 0.3202 -0.0023 -0.2534 -0.1576 -0.1644 0.1980 -0.1224 -0.1491 0.2156 -0.1872 -0.1529 -0.1036 -0.1190 -0.1314 0.0757 0.0883 0.1051 0.0889 0.0777 0.0907 0.0921 0.0911 0.0771 0.0921 0.0890 0.1044 0.0880 0.1175 0.1238 0.1204 0.1300 0.1336 0.1269 0.1359 0.1271 0.1294 0.1274
va: 2.1271 2.0847 2.1099 3.1186 3.7240 3.7246 3.9482 3.9226 3.9062 3.9074 3.9213 4.1414 3.8151 3.7209 4.0188 4.0158 4.0396 3.9055 3.9742 3.9361 3.8264 4.0317 3.9604 3.9382 3.9423 3.9505 1.0339 1.0034 1.0170 0.9989 1.0104 1.0061 1.0009 1.0061 1.0103 1.0010 0.9992 1.0170 1.0034 1.0243 1.0349 1.0176 1.0015 1.0047 1.0123 1.0019 0.9990 0.9995 0.9999
dispcorr: -0.023169550 hartree
energy: -1132.699141323376
dipole: 29.92944 -28.98443 0.94501 5.18361 -6.43839 -1.25478 1.09091 -0.59948 0.49143
magnitude: 1.64591 au
magnitude: 4.18358 debye
