program: Orca
programVersion: 5.0.2
elementType: O O O N C C C C C C C C C C C C C C C C C C C C C C H H H H H H H H H H H H H H H H H H H H H H H
charge: 0
multiplicity: 1
keywords: wb97x-d3
keywords: def2-TZVPP
keywords: def2/J RIJCOSX
keywords: DEFGRID2
keywords: scfconv7
keywords: smallprint printgap noloewdin
keywords: NOSOSCF
formula: C22H23NO3
InChI: InChI=1/C22H23NO3/c1-21(2)19(22(21,3)4)20(24)26-18(14-23)15-9-8-12-17(13-15)25-16-10-6-5-7-11-16/h5-13,18-19H,1-4H3
49 atoms
O  0.679486 2.30523 0.36241
O  1.59868 1.701816 -1.584709
O  -2.378464 -2.685177 -0.864675
N  -2.455214 3.004969 1.184978
C  4.325937 2.457237 -0.215311
C  3.840269 3.76789 -0.748946
C  2.89192 2.891582 0.066184
C  4.623065 1.306544 -1.150271
C  5.244314 2.422798 0.987903
C  4.263773 5.063187 -0.089146
C  3.62645 3.961804 -2.232814
C  1.711137 2.231767 -0.514271
C  -0.538599 1.708143 -0.031651
C  -0.62035 0.241937 0.334083
C  -1.597239 2.449821 0.660877
C  -1.437455 -0.585611 -0.420501
C  0.047827 -0.255473 1.443666
C  -1.587231 -1.918563 -0.067473
C  -0.094779 -1.593896 1.775204
C  -0.906827 -2.432653 1.030134
C  -3.135001 -3.676237 -0.302461
C  -3.129652 -4.919459 -0.915249
C  -3.926129 -3.440922 0.815216
C  -3.92528 -5.934798 -0.405286
C  -4.708875 -4.466842 1.319658
C  -4.712211 -5.716094 0.715154
H  2.716523 3.245012 1.076383
H  4.529399 0.357365 -0.619971
H  3.978564 1.251551 -2.020707
H  5.654361 1.383748 -1.500339
H  5.001775 3.167502 1.743391
H  5.19203 1.445706 1.471154
H  6.280544 2.583873 0.683836
H  3.54715 5.853413 -0.318105
H  4.332752 4.998339 0.994728
H  5.237695 5.38383 -0.464213
H  2.89572 4.753482 -2.407302
H  4.563426 4.276704 -2.696347
H  3.276455 3.078644 -2.756458
H  -0.696024 1.821292 -1.109718
H  -1.965532 -0.206122 -1.287134
H  0.674019 0.387494 2.046459
H  0.434675 -1.993024 2.630049
H  -1.007267 -3.47542 1.301028
H  -2.510097 -5.082384 -1.787167
H  -3.936147 -2.465394 1.284551
H  -3.921904 -6.904232 -0.885694
H  -5.327132 -4.282832 2.188295
H  -5.328213 -6.511207 1.112641
totalener: -1132.67447278 hartree
nucrepener: 2167.67167599 hartree
electener: -3300.34614877 hartree
oneelecener: -5843.87050995 hartree
twoeener: 2543.52436118 hartree
kineticenergy: 1127.71961014 hartree
xcener: -110.665741646488 hartree
chargesum: 0.0000000
charge: -0.283310 -0.381643 -0.297896 -0.003398 0.087678 0.080772 -0.123988 -0.271919 -0.256497 -0.252729 -0.277852 0.328779 0.304500 0.084308 -0.244877 -0.201163 -0.174751 0.185404 -0.118229 -0.133217 0.211789 -0.196642 -0.141522 -0.098150 -0.121578 -0.136522 0.077572 0.087227 0.106185 0.088883 0.078251 0.089056 0.093182 0.091560 0.077804 0.092406 0.088519 0.090293 0.104887 0.122260 0.109903 0.124545 0.128149 0.134811 0.127143 0.137496 0.126359 0.129089 0.127078
qa: -0.2833 -0.3816 -0.2979 -0.0034 0.0877 0.0808 -0.1240 -0.2719 -0.2565 -0.2527 -0.2779 0.3288 0.3045 0.0843 -0.2449 -0.2012 -0.1748 0.1854 -0.1182 -0.1332 0.2118 -0.1966 -0.1415 -0.0981 -0.1216 -0.1365 0.0776 0.0872 0.1062 0.0889 0.0783 0.0891 0.0932 0.0916 0.0778 0.0924 0.0885 0.0903 0.1049 0.1223 0.1099 0.1245 0.1281 0.1348 0.1271 0.1375 0.1264 0.1291 0.1271
va: 2.1046 2.1145 2.1038 3.1246 3.7183 3.7473 3.9299 3.9206 3.9076 3.9043 3.9239 4.1670 3.8255 3.6940 4.0038 4.1066 4.0136 3.9179 3.9657 3.9339 3.8284 4.0297 3.9397 3.9372 3.9485 3.9523 1.0331 1.0036 1.0170 0.9987 1.0096 1.0063 1.0013 1.0062 1.0101 1.0011 1.0032 0.9994 1.0166 1.0288 1.0242 1.0196 1.0017 1.0030 1.0126 1.0022 0.9988 0.9997 0.9999
dispcorr: -0.023092199 hartree
energy: -1132.697564978830
dipole: 31.46964 -30.10671 1.36293 12.35213 -13.11968 -0.76755 -1.66913 1.88429 0.21517
magnitude: 1.57892 au
magnitude: 4.01330 debye
