program: Orca
programVersion: 5.0.2
elementType: O O O N C C C C C C C C C C C C C C C C C C C C C C H H H H H H H H H H H H H H H H H H H H H H H
charge: 0
multiplicity: 1
keywords: wb97x-d3
keywords: def2-TZVPP
keywords: def2/J RIJCOSX
keywords: DEFGRID2
keywords: scfconv7
keywords: smallprint printgap noloewdin
keywords: NOSOSCF
formula: C22H23NO3
InChI: InChI=1/C22H23NO3/c1-21(2)19(22(21,3)4)20(24)26-18(14-23)15-9-8-12-17(13-15)25-16-10-6-5-7-11-16/h5-13,18-19H,1-4H3
49 atoms
O  0.567251 2.428668 0.294163
O  1.602598 1.532238 -1.473113
O  -1.939674 -2.776732 -0.786462
N  -2.547806 3.418236 0.743354
C  4.257988 2.356071 -0.005689
C  3.859181 3.622174 -0.69696
C  2.826383 2.857251 0.12859
C  4.578774 1.113386 -0.805351
C  5.08863 2.412394 1.258989
C  4.278576 4.964613 -0.137603
C  3.757273 3.671875 -2.204468
C  1.659936 2.187114 -0.468982
C  -0.650989 1.843965 -0.128101
C  -0.834377 0.448051 0.420024
C  -1.706962 2.732578 0.366046
C  -1.299764 -0.554759 -0.413631
C  -0.578755 0.18518 1.76039
C  -1.517922 -1.829543 0.093252
C  -0.788094 -1.091981 2.251565
C  -1.258103 -2.105103 1.429264
C  -2.781653 -3.767759 -0.363242
C  -3.932658 -3.485096 0.361852
C  -2.480014 -5.069916 -0.730653
C  -4.780184 -4.521513 0.719399
C  -3.342533 -6.0962 -0.374777
C  -4.491047 -5.828817 0.354285
H  2.595752 3.315214 1.084184
H  4.419057 0.222194 -0.196305
H  3.989947 0.994128 -1.707685
H  5.632775 1.129783 -1.089544
H  6.149364 2.503371 1.017165
H  4.828005 3.239631 1.916087
H  4.959351 1.49315 1.832494
H  3.603233 5.745573 -0.490549
H  4.272379 5.00448 0.949647
H  5.284819 5.223364 -0.47274
H  3.076077 4.468281 -2.509113
H  4.737121 3.90244 -2.62692
H  3.405287 2.753675 -2.662392
H  -0.713345 1.8203 -1.220911
H  -1.493208 -0.361495 -1.461525
H  -0.222063 0.968361 2.416083
H  -0.584745 -1.30692 3.29204
H  -1.416236 -3.099179 1.82637
H  -4.169454 -2.46562 0.638769
H  -1.579962 -5.270241 -1.296755
H  -5.678405 -4.301768 1.281201
H  -3.108909 -7.11185 -0.665438
H  -5.160051 -6.631972 0.631769
totalener: -1132.67499606 hartree
nucrepener: 2170.13908632 hartree
electener: -3302.81408238 hartree
oneelecener: -5848.84793639 hartree
twoeener: 2546.03385402 hartree
kineticenergy: 1127.72331278 hartree
xcener: -110.665704990425 hartree
chargesum: -0.0000000
charge: -0.276694 -0.385144 -0.296878 -0.004511 0.088066 0.080228 -0.123506 -0.272092 -0.256383 -0.253583 -0.278537 0.335211 0.312039 0.054348 -0.249281 -0.169565 -0.181851 0.183361 -0.115270 -0.134510 0.217890 -0.147196 -0.197352 -0.120265 -0.097324 -0.136535 0.075809 0.087783 0.105336 0.088157 0.092337 0.077546 0.090016 0.091478 0.077527 0.092399 0.088649 0.091147 0.104150 0.117727 0.110966 0.125200 0.128853 0.134867 0.135942 0.127459 0.129145 0.125976 0.126865
qa: -0.2767 -0.3851 -0.2969 -0.0045 0.0881 0.0802 -0.1235 -0.2721 -0.2564 -0.2536 -0.2785 0.3352 0.3120 0.0543 -0.2493 -0.1696 -0.1819 0.1834 -0.1153 -0.1345 0.2179 -0.1472 -0.1974 -0.1203 -0.0973 -0.1365 0.0758 0.0878 0.1053 0.0882 0.0923 0.0775 0.0900 0.0915 0.0775 0.0924 0.0886 0.0911 0.1042 0.1177 0.1110 0.1252 0.1289 0.1349 0.1359 0.1275 0.1291 0.1260 0.1269
va: 2.1140 2.1120 2.1052 3.1224 3.7168 3.7424 3.9354 3.9199 3.9083 3.9055 3.9249 4.1746 3.8321 3.6817 4.0200 4.0753 4.0203 3.9215 3.9609 3.9307 3.8229 3.9441 4.0312 3.9490 3.9364 3.9541 1.0334 1.0036 1.0174 0.9989 1.0013 1.0099 1.0061 1.0061 1.0103 1.0011 1.0033 0.9994 1.0166 1.0283 1.0247 1.0191 1.0012 1.0031 1.0026 1.0127 0.9997 0.9990 1.0000
dispcorr: -0.023024769 hartree
energy: -1132.698020829817
dipole: 30.82088 -29.62034 1.20054 11.04321 -11.90663 -0.86342 -0.38973 0.78557 0.39584
magnitude: 1.53084 au
magnitude: 3.89109 debye
