program: Orca
programVersion: 5.0.2
elementType: O O O N C C C C C C C C C C C C C C C C C C C C C C H H H H H H H H H H H H H H H H H H H H H H H
charge: 0
multiplicity: 1
keywords: wb97x-d3
keywords: def2-TZVPP
keywords: def2/J RIJCOSX
keywords: DEFGRID2
keywords: scfconv7
keywords: smallprint printgap noloewdin
keywords: NOSOSCF
formula: C22H23NO3
InChI: InChI=1/C22H23NO3/c1-21(2)19(22(21,3)4)20(24)26-18(14-23)15-9-8-12-17(13-15)25-16-10-6-5-7-11-16/h5-13,18-19H,1-4H3
49 atoms
O  0.614959 2.216245 0.852444
O  0.811626 2.711148 -1.316723
O  -0.978475 -2.588803 0.716598
N  -1.78621 2.667133 3.089031
C  3.74191 1.60873 -0.968126
C  3.870418 3.06583 -0.652593
C  2.767508 2.251935 0.015605
C  3.278006 1.156285 -2.334191
C  4.710899 0.610427 -0.37107
C  4.97189 3.550687 0.266226
C  3.539425 4.110112 -1.694533
C  1.335437 2.427568 -0.27418
C  -0.793617 2.250136 0.707366
C  -1.335248 0.961423 0.134738
C  -1.330385 2.484086 2.050904
C  -0.943196 -0.250042 0.687618
C  -2.228273 0.992703 -0.92399
C  -1.444237 -1.43404 0.16982
C  -2.731897 -0.197404 -1.426616
C  -2.344181 -1.413731 -0.891321
C  -1.792765 -3.685065 0.783249
C  -3.073419 -3.607823 1.316265
C  -1.279036 -4.897798 0.350897
C  -3.839315 -4.759026 1.408091
C  -2.052954 -6.043913 0.457422
C  -3.335637 -5.979373 0.979746
H  2.954812 2.009361 1.055794
H  2.55217 1.810571 -2.804383
H  4.139637 1.077535 -3.000007
H  2.824609 0.165885 -2.268391
H  4.998925 0.840443 0.6526
H  4.265161 -0.385474 -0.363627
H  5.623334 0.557994 -0.968252
H  4.705359 4.518544 0.69329
H  5.17305 2.877906 1.097072
H  5.903353 3.681404 -0.287902
H  2.729113 3.839778 -2.362588
H  3.260696 5.048038 -1.211092
H  4.424315 4.307966 -2.302605
H  -1.100796 3.08851 0.07347
H  -0.251003 -0.287312 1.519857
H  -2.520435 1.937599 -1.36282
H  -3.423873 -0.180666 -2.257768
H  -2.732671 -2.336831 -1.301013
H  -3.466086 -2.660113 1.662536
H  -0.277683 -4.938582 -0.057044
H  -4.835998 -4.700375 1.824815
H  -1.649501 -6.990705 0.123613
H  -3.937892 -6.874165 1.057925
totalener: -1132.67536793 hartree
nucrepener: 2203.15520112 hartree
electener: -3335.83056905 hartree
oneelecener: -5914.93162410 hartree
twoeener: 2579.10105504 hartree
kineticenergy: 1127.72756356 hartree
xcener: -110.666824012254 hartree
chargesum: -0.0000000
charge: -0.276347 -0.383921 -0.297785 -0.003282 0.083333 0.083610 -0.117069 -0.274085 -0.256174 -0.253245 -0.275712 0.327431 0.330649 0.041119 -0.258754 -0.206365 -0.137583 0.188173 -0.113063 -0.142869 0.213375 -0.143668 -0.193413 -0.120806 -0.100408 -0.133814 0.076870 0.104676 0.089639 0.089081 0.078084 0.091430 0.092386 0.090936 0.077946 0.092307 0.104274 0.087536 0.088614 0.118395 0.123131 0.108018 0.128782 0.134055 0.137432 0.125453 0.128917 0.125878 0.126833
qa: -0.2763 -0.3839 -0.2978 -0.0033 0.0833 0.0836 -0.1171 -0.2741 -0.2562 -0.2532 -0.2757 0.3274 0.3306 0.0411 -0.2588 -0.2064 -0.1376 0.1882 -0.1131 -0.1429 0.2134 -0.1437 -0.1934 -0.1208 -0.1004 -0.1338 0.0769 0.1047 0.0896 0.0891 0.0781 0.0914 0.0924 0.0909 0.0779 0.0923 0.1043 0.0875 0.0886 0.1184 0.1231 0.1080 0.1288 0.1341 0.1374 0.1255 0.1289 0.1259 0.1268
va: 2.1185 2.1119 2.1042 3.1233 3.7309 3.7355 3.9347 3.9221 3.9061 3.9047 3.9211 4.1768 3.8277 3.6632 4.0268 4.0617 4.0189 3.8954 3.9689 3.9348 3.8289 3.9458 4.0305 3.9453 3.9394 3.9518 1.0335 1.0169 0.9991 1.0033 1.0101 1.0061 1.0011 1.0063 1.0103 1.0010 1.0174 1.0037 0.9990 1.0220 1.0312 1.0139 1.0013 1.0033 1.0020 1.0130 0.9998 0.9991 1.0000
dispcorr: -0.023427341 hartree
energy: -1132.698795270243
dipole: 27.04295 -26.36924 0.67371 6.08659 -6.89199 -0.80540 -12.19874 11.02917 -1.16958
magnitude: 1.57177 au
magnitude: 3.99512 debye
