program: Orca
programVersion: 5.0.2
elementType: O O O N C C C C C C C C C C C C C C C C C C C C C C H H H H H H H H H H H H H H H H H H H H H H H
charge: 0
multiplicity: 1
keywords: wb97x-d3
keywords: def2-TZVPP
keywords: def2/J RIJCOSX
keywords: DEFGRID2
keywords: scfconv7
keywords: smallprint printgap noloewdin
keywords: NOSOSCF
formula: C22H23NO3
InChI: InChI=1/C22H23NO3/c1-21(2)19(22(21,3)4)20(24)26-18(14-23)15-9-8-12-17(13-15)25-16-10-6-5-7-11-16/h5-13,18-19H,1-4H3
49 atoms
O  0.453172 1.523752 0.692941
O  0.722662 2.856774 -1.08069
O  -2.685961 -2.566215 -0.634877
N  -1.732816 1.555031 3.174018
C  3.416785 1.280987 -1.44748
C  3.789165 2.439102 -0.576051
C  2.576773 1.590294 -0.211492
C  2.858301 1.504123 -2.834853
C  4.223403 0.000913 -1.390883
C  4.969209 2.327382 0.366423
C  3.625396 3.860894 -1.064497
C  1.191175 2.080928 -0.291353
C  -0.933157 1.838731 0.701912
C  -1.708801 0.946582 -0.236783
C  -1.368769 1.67257 2.091033
C  -1.820546 -0.411607 0.046765
C  -2.268005 1.478218 -1.386065
C  -2.508089 -1.235393 -0.831495
C  -2.958474 0.642467 -2.254394
C  -3.079571 -0.706654 -1.986488
C  -2.05514 -3.181006 0.415943
C  -0.727367 -3.563743 0.297077
C  -2.771006 -3.444318 1.572215
C  -0.114873 -4.22358 1.35139
C  -2.148788 -4.107593 2.619732
C  -0.821772 -4.495684 2.513984
H  2.732255 0.912859 0.620863
H  3.67975 1.55726 -3.551505
H  2.225632 0.663817 -3.125012
H  2.263344 2.404234 -2.942502
H  5.120085 0.086674 -2.007864
H  4.539192 -0.271739 -0.386004
H  3.634771 -0.831112 -1.780765
H  5.06153 1.350601 0.836178
H  5.902414 2.530586 -0.162015
H  4.878514 3.061725 1.167979
H  2.790473 4.013976 -1.738863
H  3.484243 4.534688 -0.217852
H  4.535476 4.173374 -1.580015
H  -1.092688 2.885884 0.42692
H  -1.384939 -0.812973 0.95363
H  -2.157957 2.530385 -1.610138
H  -3.399869 1.047561 -3.154914
H  -3.615434 -1.36186 -2.660678
H  -0.184066 -3.351556 -0.614767
H  -3.805754 -3.136611 1.64601
H  0.91962 -4.527483 1.26206
H  -2.705006 -4.316708 3.523625
H  -0.340193 -5.01095 3.333933
totalener: -1132.67564084 hartree
nucrepener: 2252.24142746 hartree
electener: -3384.91706830 hartree
oneelecener: -6013.20017367 hartree
twoeener: 2628.28310537 hartree
kineticenergy: 1127.73043247 hartree
xcener: -110.667178363072 hartree
chargesum: -0.0000000
charge: -0.266711 -0.397673 -0.295544 -0.005617 0.077752 0.082983 -0.115788 -0.273814 -0.256280 -0.256486 -0.273683 0.350015 0.332084 -0.017081 -0.266255 -0.173217 -0.140574 0.239430 -0.083639 -0.206601 0.188254 -0.144944 -0.140124 -0.126730 -0.120099 -0.111690 0.076354 0.089246 0.088674 0.104538 0.093057 0.077589 0.088757 0.077425 0.092285 0.091287 0.104798 0.088178 0.087737 0.116489 0.124158 0.114160 0.125731 0.126230 0.126273 0.127075 0.126530 0.128324 0.127139
qa: -0.2667 -0.3977 -0.2955 -0.0056 0.0778 0.0830 -0.1158 -0.2738 -0.2563 -0.2565 -0.2737 0.3500 0.3321 -0.0171 -0.2663 -0.1732 -0.1406 0.2394 -0.0836 -0.2066 0.1883 -0.1449 -0.1401 -0.1267 -0.1201 -0.1117 0.0764 0.0892 0.0887 0.1045 0.0931 0.0776 0.0888 0.0774 0.0923 0.0913 0.1048 0.0882 0.0877 0.1165 0.1242 0.1142 0.1257 0.1262 0.1263 0.1271 0.1265 0.1283 0.1271
va: 2.1349 2.0965 2.1169 3.1218 3.7328 3.7244 3.9307 3.9230 3.9060 3.9079 3.9203 4.1634 3.8332 3.7206 4.0298 3.9697 3.9958 3.8524 3.9560 4.0364 3.8658 3.9909 4.0132 3.9498 3.9524 3.9400 1.0333 0.9991 1.0030 1.0172 1.0009 1.0103 1.0063 1.0100 1.0013 1.0060 1.0171 1.0031 0.9992 1.0214 1.0232 1.0208 0.9996 1.0135 1.0069 1.0089 1.0000 0.9999 0.9999
dispcorr: -0.023951691 hartree
energy: -1132.699592532244
dipole: 30.92266 -29.81457 1.10808 6.76846 -7.26302 -0.49456 -10.15263 9.24834 -0.90429
magnitude: 1.51334 au
magnitude: 3.84659 debye
