program: Orca
programVersion: 5.0.2
elementType: O O O N C C C C C C C C C C C C C C C C C C C C C C H H H H H H H H H H H H H H H H H H H H H H H
charge: 0
multiplicity: 1
keywords: wb97x-d3
keywords: def2-TZVPP
keywords: def2/J RIJCOSX
keywords: DEFGRID2
keywords: scfconv7
keywords: smallprint printgap noloewdin
keywords: NOSOSCF
formula: C22H23NO3
InChI: InChI=1/C22H23NO3/c1-21(2)19(22(21,3)4)20(24)26-18(14-23)15-9-8-12-17(13-15)25-16-10-6-5-7-11-16/h5-13,18-19H,1-4H3
49 atoms
O  0.628168 1.310188 0.421512
O  0.82581 2.993526 -1.039712
O  -3.059465 -2.666553 -0.3285
N  -1.275662 1.331583 3.13175
C  3.598128 1.719048 -1.744608
C  3.913075 2.566774 -0.55213
C  2.722055 1.612262 -0.501276
C  3.076566 2.347077 -3.01734
C  4.441724 0.499931 -2.05386
C  5.077164 2.21323 0.348476
C  3.699427 4.062991 -0.596082
C  1.326391 2.077224 -0.443232
C  -0.756044 1.601575 0.58529
C  -1.593406 0.693349 -0.281885
C  -1.041165 1.439307 2.012575
C  -1.930052 -0.583585 0.152446
C  -1.973422 1.133596 -1.541603
C  -2.653703 -1.421417 -0.68481
C  -2.696167 0.28559 -2.368102
C  -3.035419 -0.987552 -1.950063
C  -2.460847 -3.303797 0.726403
C  -1.124438 -3.674774 0.664618
C  -3.232268 -3.613225 1.834398
C  -0.560847 -4.358616 1.729983
C  -2.658724 -4.305256 2.891299
C  -1.323696 -4.67502 2.845563
H  2.888199 0.721673 0.094437
H  2.509104 1.614359 -3.593397
H  2.431573 3.205147 -2.865796
H  3.919305 2.664796 -3.634459
H  4.759926 -0.046123 -1.168198
H  3.878086 -0.196943 -2.676106
H  5.338735 0.783988 -2.607543
H  6.009067 2.612441 -0.056595
H  4.93364 2.652344 1.336944
H  5.210557 1.142806 0.489692
H  3.55301 4.451502 0.413186
H  4.589509 4.545514 -1.004336
H  2.847944 4.378796 -1.18909
H  -0.958263 2.644416 0.324515
H  -1.645177 -0.91418 1.144017
H  -1.701164 2.125052 -1.877829
H  -2.997086 0.620666 -3.351583
H  -3.601646 -1.651283 -2.590122
H  -0.533053 -3.432776 -0.209368
H  -4.272556 -3.317435 1.863101
H  0.480196 -4.649629 1.6851
H  -3.259965 -4.548063 3.757198
H  -0.878955 -5.209238 3.674053
totalener: -1132.67608892 hartree
nucrepener: 2223.72113525 hartree
electener: -3356.39722417 hartree
oneelecener: -5956.12469423 hartree
twoeener: 2599.72747006 hartree
kineticenergy: 1127.72206999 hartree
xcener: -110.666442101008 hartree
chargesum: -0.0000000
charge: -0.263191 -0.404334 -0.294597 -0.006614 0.086536 0.081767 -0.132599 -0.275076 -0.255256 -0.254888 -0.278478 0.369714 0.318210 -0.016721 -0.256111 -0.163423 -0.152993 0.218420 -0.093236 -0.196434 0.208527 -0.155677 -0.167932 -0.114998 -0.105374 -0.123921 0.075229 0.086497 0.105136 0.088860 0.077584 0.089776 0.092748 0.092362 0.092221 0.077153 0.090022 0.089529 0.104327 0.120023 0.129736 0.127996 0.126924 0.126830 0.129893 0.125725 0.126426 0.127205 0.126474
qa: -0.2632 -0.4043 -0.2946 -0.0066 0.0865 0.0818 -0.1326 -0.2751 -0.2553 -0.2549 -0.2785 0.3697 0.3182 -0.0167 -0.2561 -0.1634 -0.1530 0.2184 -0.0932 -0.1964 0.2085 -0.1557 -0.1679 -0.1150 -0.1054 -0.1239 0.0752 0.0865 0.1051 0.0889 0.0776 0.0898 0.0927 0.0924 0.0922 0.0772 0.0900 0.0895 0.1043 0.1200 0.1297 0.1280 0.1269 0.1268 0.1299 0.1257 0.1264 0.1272 0.1265
va: 2.1248 2.0873 2.1128 3.1164 3.7175 3.7280 3.9429 3.9202 3.9065 3.9058 3.9241 4.1460 3.8134 3.7689 4.0297 3.9832 3.9694 3.8817 3.9591 4.0293 3.8449 3.9817 4.0358 3.9463 3.9437 3.9535 1.0340 1.0036 1.0169 0.9992 1.0103 1.0061 1.0012 1.0007 1.0062 1.0102 1.0029 0.9993 1.0168 1.0268 1.0175 1.0195 0.9997 1.0128 1.0044 1.0117 1.0000 0.9995 1.0001
dispcorr: -0.023517597 hartree
energy: -1132.699606518809
dipole: 31.39934 -30.38941 1.00993 9.65975 -10.14684 -0.48709 -10.87560 9.86884 -1.00676
magnitude: 1.50691 au
magnitude: 3.83026 debye
