program: Gaussian 09
title: 000002174
version: EM64L-G09RevD.01
frameworkgroup: C1[X(C16H19N3O4S)]
method: RPBEPBE
basis: SDD
operation: Freq
keyword: #p
keyword: freq=noraman
keyword: PBEPBE/SDD
title: #p freq=noraman PBEPBE/SDD
converged: YES YES NO NO
title: Mulliken charges:
elementType: S O O O O N N N C C C C C C C C C C C C C C C C H H H H H H H H H H H H H H H H H H H
charge: 0.222152 -0.173714 -0.414175 -0.198974 -0.277359 -0.124708 -0.364385 -0.654721 -0.453861 -0.160519 -0.073592 -0.174856 0.096029 -0.690200 -0.656896 0.158914 0.207118 -0.311765 0.421171 -0.462302 -0.371129 -0.222200 -0.221765 -0.238998 0.312435 0.292089 0.310199 0.230262 0.243680 0.240396 0.242248 0.252167 0.221468 0.347314 0.241660 0.386933 0.273517 0.319944 0.251072 0.285081 0.231290 0.227836 0.231143
chargesum: 0.00000
title: Mulliken charges with hydrogens summed into heavy atoms:
elementType: S O O O O N N N C C C C C C C C C C C C C C C C
charge: 0.222152 -0.173714 -0.027242 -0.198974 -0.277359 -0.124708 -0.017071 -0.061260 -0.141426 -0.160519 0.218497 0.135343 0.096029 0.024139 0.058987 0.158914 0.207118 -0.070105 0.421171 -0.211231 -0.086048 0.009090 0.006071 -0.007855
polarizability: 2.38097966e+02 6.30893040e+00 2.26109746e+02 6.50562397e-01 3.32518603e+00 1.89914368e+02
1716.lowfreq: -9.2121 -5.3068 -0.0019 -0.0018 -0.0013 7.0030 13.5461 22.4233 29.1298
frequency: 10.7412 22.3164 28.9622 46.0681 49.8405 59.3115 59.5644 69.2608 102.9111 127.3642 139.3117 175.9277 195.7503 209.8446 216.7029 243.3223 248.8931 267.9387 280.2380 291.7149 294.0673 312.1509 341.8856 357.2820 359.9024 383.1086 383.3758 410.8978 426.4168 451.8255 479.8637 515.9949 524.3487 542.2365 551.8839 583.8905 612.2761 619.6255 621.6841 637.7264 655.3372 686.5158 702.7326 710.9503 722.9924 739.6545 771.1444 779.2486 829.7907 834.8788 836.7655 865.7651 892.6087 912.4713 937.4630 944.3834 947.4135 980.9855 986.6970 988.9643 990.2129 1002.4847 1009.1942 1023.4937 1038.2020 1066.0879 1070.1767 1103.6528 1126.9046 1131.3614 1140.4034 1150.5012 1171.0371 1180.6207 1185.2266 1192.5513 1200.2299 1213.7461 1218.7031 1239.3573 1247.0497 1279.6251 1287.6636 1289.9448 1304.3445 1325.5875 1336.2457 1353.7783 1385.1706 1388.4413 1407.1907 1440.2704 1460.1160 1464.2221 1478.0741 1480.1192 1480.4939 1484.8816 1584.1653 1591.7679 1608.0008 1643.5227 1678.8027 1729.8384 2836.8396 2981.2105 2988.3544 3024.3789 3058.8722 3075.4387 3084.8494 3086.4941 3094.8633 3105.9903 3107.6999 3127.1460 3140.4708 3153.7438 3165.1612 3464.9139 3503.9069 3516.1110 3612.6557
redmass: 5.4959 7.1089 4.4999 4.6624 8.3370 8.2492 5.4581 7.2674 8.2695 6.7228 6.4301 5.5301 4.7394 3.7772 3.5296 2.0878 1.3365 4.6830 4.1005 1.1611 4.5047 2.0012 4.2488 2.9888 4.2923 3.4432 2.9836 2.6776 6.0386 4.0769 4.8906 3.7575 3.7078 3.8782 4.0405 3.4016 4.9831 1.6297 4.5235 1.5687 1.1808 3.5228 5.1270 2.0892 6.3949 2.7246 3.2380 3.6982 4.0187 4.4431 4.8531 1.2519 4.4970 4.5548 1.4890 2.5593 1.5135 4.4487 1.4119 5.3397 4.0879 1.3334 1.3481 2.2029 2.7555 2.6010 1.7363 2.3967 1.7891 2.3258 1.4157 1.5710 1.0652 1.1076 2.0858 1.5965 2.1349 1.5751 1.6928 2.1357 1.7465 1.6519 1.7652 3.8663 1.5547 1.6354 1.3999 1.5448 6.7418 1.1930 1.1914 2.1507 1.0489 1.0471 2.2750 1.0526 1.0537 1.9346 2.1210 5.8547 5.8000 1.8120 9.0948 12.6824 1.0792 1.0385 1.0356 1.0842 1.0843 1.0964 1.0900 1.0991 1.1007 1.1003 1.0884 1.0860 1.0913 1.0950 1.1011 1.0467 1.0781 1.0642 1.0972
irintensity: 0.1939 1.1985 1.1107 0.6348 0.0110 2.7297 0.4890 4.5372 1.6242 2.1938 0.7671 0.9414 1.7068 0.7722 3.2203 2.0625 1.5789 0.3784 8.6499 0.6399 8.7492 22.1116 1.7759 8.5292 0.7820 25.9174 30.0437 5.1645 6.2481 22.0682 12.4883 48.0283 28.2309 7.4195 15.8795 32.2977 12.0900 104.6983 12.8256 151.5345 32.6012 12.7352 47.1254 50.4998 6.2814 27.0739 13.8483 32.8505 6.8712 10.1516 7.5344 0.1011 3.9045 32.7794 13.6139 1.6941 1.2927 22.9607 0.9028 0.2459 2.8400 1.4492 3.9036 8.8121 209.0664 160.0974 10.4678 9.1721 46.5715 2.0219 12.6066 22.1437 0.7230 1.4359 7.5582 23.7706 19.9157 21.6095 4.4619 105.7359 9.0010 14.6881 12.2735 152.2665 7.3095 19.2759 7.6951 19.7183 3.4103 26.8045 18.1067 15.5821 0.4746 6.4711 14.1588 4.8901 11.0321 373.0266 281.7761 8.0987 11.3851 30.6518 186.9076 404.3367 52.5637 19.5087 18.1868 5.3633 27.4163 14.8416 14.8377 13.4247 15.1081 18.0237 8.3732 1.1617 18.0462 14.4550 23.4867 18.8553 70.1233 34.5226 16.1275
temp: 298.150 k
press: 1.00000 atm
elementType: 16 8 8 8 8 7 7 7 6 6 6 6 6 6 6 6 6 6 6 6 6 6 6 6 1 1 1 1 1 1 1 1 1 1 1 1 1 1 1 1 1 1 1
symmnumber: 1
zpe: 875042.9 jmol-1
zpe.correction: 0.333286 hartree
zpe.thermalcorrener: 0.356887 hartree
zpe.thermalcorrenthalpy: 0.357831 hartree
zpe.thermalcorrgfe: 0.277263 hartree
zpe.sumelectzpe: -1482.538718 hartree
zpe.sumelectthermal: -1482.515118 hartree
zpe.sumelectthermalent: -1482.514174 hartree
zpe.sumelectthermalfe: -1482.594742 hartree
dipole: 1.9266 2.8759 -1.8750
dipole: 3.9368
quadrupole: -117.2452 -153.4750 -154.0454
quadrupole: 1.3426 -7.0823 -1.3733
quadrupole: 24.3433 -11.8865 -12.4569 1.3426 -7.0823 -1.3733
hfenergy: -1482.8720046 hartree
pointgroup: C01 [X(C16H19N3O4S1)]
dipole: -0.6378293 1.2860097 0.5816262 debye
polarizability: 237.2467959|-7.743649|224.273883|-3.2915997|-9.0713088|192.6014008 unknown
InChI: InChI=1S/C16H19N3O4S/c1-16(2)11(15(22)23)19-13(21)10(14(19)24-16)18-12(20)9(17)8-6-4-3-5-7-8/h3-7,9-11,14,18,22H,17H2,1-2H3
charge 0 multiplicity 1
43 atoms
S  -2.365057 -1.49351 1.795839
O  -1.50642 -0.760559 -2.591455
O  -5.153317 1.833224 -0.609501
O  -3.02928 2.747557 -0.345234
O  1.836886 -3.090752 0.152359
N  -1.960943 0.049675 -0.344141
N  1.117243 -0.973785 -0.487715
N  4.442996 -2.329917 0.197232
C  -1.12693 -0.500353 0.754193
C  -3.730447 -0.167452 1.364356
C  -3.385438 0.287951 -0.126986
C  -0.28504 -1.278548 -0.330925
C  -1.294323 -0.666245 -1.370802
C  -5.107348 -0.850523 1.42881
C  -3.614934 0.989398 2.380105
C  -3.772946 1.750526 -0.366917
C  2.098898 -1.922791 -0.262571
C  3.557058 -1.495638 -0.614021
C  3.807701 0.004043 -0.410773
C  3.667296 0.911846 -1.491262
C  4.158971 0.5015 0.869214
C  3.856626 2.300228 -1.293195
C  4.348774 1.886016 1.067428
C  4.193669 2.790924 -0.011156
H  -0.586734 0.233361 1.369629
H  -3.971855 -0.328807 -0.83367
H  -0.395547 -2.372558 -0.23629
H  -5.335028 -1.173897 2.459717
H  -5.891054 -0.139135 1.109798
H  -5.149065 -1.735374 0.770302
H  -3.734897 0.596214 3.402946
H  -2.638258 1.499589 2.319466
H  -4.40822 1.742412 2.207366
H  1.405929 -0.031943 -0.768111
H  3.635533 -1.69728 -1.714088
H  -5.406852 2.783539 -0.764474
H  5.412396 -2.368916 -0.121082
H  4.02877 -3.237951 0.433494
H  3.42854 0.532853 -2.494169
H  4.298117 -0.220614 1.680812
H  3.749304 2.991909 -2.136129
H  4.621057 2.262791 2.060045
H  4.34397 3.86509 0.144554
