program: Orca
programVersion: 5.0.2
elementType: O O O N C C C C C C C C C C C C C C C C C C C C C C H H H H H H H H H H H H H H H H H H H H H H H
charge: 0
multiplicity: 1
keywords: wb97x-d3
keywords: def2-TZVPP
keywords: def2/J RIJCOSX
keywords: DEFGRID2
keywords: scfconv7
keywords: smallprint printgap noloewdin
keywords: NOSOSCF
formula: C22H23NO3
InChI: InChI=1/C22H23NO3/c1-21(2)19(22(21,3)4)20(24)26-18(14-23)15-9-8-12-17(13-15)25-16-10-6-5-7-11-16/h5-13,18-19H,1-4H3
49 atoms
O  0.230242 1.755215 0.937077
O  0.73567 2.659985 -1.041106
O  -2.675139 -2.285196 -0.452125
N  -2.148134 2.306901 3.170383
C  3.135759 0.631037 -0.968674
C  3.696731 1.869277 -0.341106
C  2.357503 1.329449 0.144763
C  2.626452 0.650509 -2.392318
C  3.70598 -0.72699 -0.619545
C  4.837669 1.765926 0.648951
C  3.778057 3.162451 -1.121733
C  1.06736 1.995526 -0.097374
C  -1.105338 2.205689 0.776315
C  -1.901644 1.278741 -0.112673
C  -1.673476 2.255645 2.125839
C  -1.898368 -0.084071 0.159641
C  -2.613949 1.782431 -1.187608
C  -2.611069 -0.944079 -0.662701
C  -3.3414 0.913969 -1.989399
C  -3.338126 -0.445668 -1.738662
C  -1.657622 -2.916538 0.2095
C  -0.345236 -2.831263 -0.238721
C  -1.978221 -3.687695 1.315011
C  0.647833 -3.522699 0.435856
C  -0.975748 -4.383162 1.97549
C  0.338754 -4.299811 1.543667
H  2.393342 0.824462 1.103895
H  2.181425 1.590426 -2.699732
H  3.449769 0.430182 -3.074611
H  1.870379 -0.124674 -2.533077
H  3.989453 -0.827131 0.426078
H  2.969103 -1.505195 -0.828765
H  4.588491 -0.940442 -1.225712
H  4.862174 2.652009 1.285318
H  4.768061 0.902322 1.307386
H  5.795019 1.709398 0.127429
H  2.965033 3.319067 -1.822087
H  3.782514 4.012454 -0.437125
H  4.71526 3.190841 -1.680917
H  -1.129384 3.219668 0.364018
H  -1.346373 -0.467805 1.008936
H  -2.595817 2.841743 -1.406832
H  -3.901283 1.29867 -2.831087
H  -3.893186 -1.128947 -2.367814
H  -0.10297 -2.231092 -1.106943
H  -3.005945 -3.742188 1.64881
H  1.670772 -3.457259 0.088658
H  -1.226748 -4.986657 2.837524
H  1.118299 -4.839352 2.064074
totalener: -1132.67465803 hartree
nucrepener: 2298.99868700 hartree
electener: -3431.67334503 hartree
oneelecener: -6106.38329650 hartree
twoeener: 2674.70995147 hartree
kineticenergy: 1127.72274996 hartree
xcener: -110.666208988179 hartree
chargesum: 0.0000000
charge: -0.273126 -0.383792 -0.296879 -0.001807 0.083959 0.081860 -0.107201 -0.268547 -0.258067 -0.255165 -0.275404 0.321522 0.326444 0.034291 -0.260147 -0.178950 -0.148349 0.212679 -0.084413 -0.205309 0.217471 -0.157414 -0.181629 -0.112838 -0.100152 -0.138820 0.077771 0.106846 0.090363 0.083978 0.082884 0.070117 0.096942 0.091502 0.077689 0.092746 0.105465 0.087794 0.088375 0.118214 0.133342 0.108084 0.126937 0.128439 0.130174 0.127817 0.130189 0.127643 0.126469
qa: -0.2731 -0.3838 -0.2969 -0.0018 0.0840 0.0819 -0.1072 -0.2685 -0.2581 -0.2552 -0.2754 0.3215 0.3264 0.0343 -0.2601 -0.1789 -0.1483 0.2127 -0.0844 -0.2053 0.2175 -0.1574 -0.1816 -0.1128 -0.1002 -0.1388 0.0778 0.1068 0.0904 0.0840 0.0829 0.0701 0.0969 0.0915 0.0777 0.0927 0.1055 0.0878 0.0884 0.1182 0.1333 0.1081 0.1269 0.1284 0.1302 0.1278 0.1302 0.1276 0.1265
va: 2.1222 2.1104 2.1156 3.1235 3.7257 3.7580 3.9295 3.9217 3.9089 3.9050 3.9188 4.1890 3.8458 3.6744 4.0289 3.9357 4.0208 3.8552 3.9531 4.0359 3.8602 3.9652 4.0349 3.9334 3.9415 3.9820 1.0335 1.0172 0.9994 1.0048 1.0093 1.0118 1.0034 1.0061 1.0102 1.0010 1.0173 1.0034 0.9989 1.0224 1.0212 1.0146 0.9996 1.0118 1.0030 1.0120 0.9968 0.9988 1.0010
dispcorr: -0.025611743 hartree
energy: -1132.700269768619
dipole: 31.17638 -29.92027 1.25612 0.43393 -1.08545 -0.65152 -9.14225 8.16371 -0.97854
magnitude: 1.72042 au
magnitude: 4.37296 debye
