program: Orca
programVersion: 5.0.2
elementType: O O O N C C C C C C C C C C C C C C C C C C C C C C H H H H H H H H H H H H H H H H H H H H H H H
charge: 0
multiplicity: 1
keywords: wb97x-d3
keywords: def2-TZVPP
keywords: def2/J RIJCOSX
keywords: DEFGRID2
keywords: scfconv7
keywords: smallprint printgap noloewdin
keywords: NOSOSCF
formula: C22H23NO3
InChI: InChI=1/C22H23NO3/c1-21(2)19(22(21,3)4)20(24)26-18(14-23)15-9-8-12-17(13-15)25-16-10-6-5-7-11-16/h5-13,18-19H,1-4H3
49 atoms
O  0.062211 1.948456 0.820263
O  0.782592 2.056407 -1.293099
O  -2.675853 -2.275929 0.382799
N  -2.304996 3.595381 2.454165
C  3.102988 0.197095 -0.270209
C  3.627176 1.573406 -0.005797
C  2.217457 1.209378 0.450212
C  2.779419 -0.243782 -1.679183
C  3.56807 -0.975974 0.567261
C  4.631544 1.803956 1.103456
C  3.845471 2.54687 -1.142107
C  0.997293 1.773126 -0.14703
C  -1.202885 2.411828 0.400543
C  -2.105146 1.29764 -0.087313
C  -1.803962 3.06625 1.566383
C  -1.927659 -0.000378 0.363338
C  -3.15007 1.603424 -0.94896
C  -2.798748 -0.993905 -0.064898
C  -4.024675 0.607842 -1.350055
C  -3.851056 -0.697575 -0.916556
C  -1.4670 -2.902288 0.286034
C  -1.115988 -3.768401 1.312209
C  -0.632936 -2.736644 -0.813373
C  0.073642 -4.475397 1.233984
C  0.553397 -3.451747 -0.877353
C  0.915235 -4.319864 0.142266
H  2.119972 1.043262 1.517377
H  2.003857 -1.010873 -1.657389
H  2.431485 0.547099 -2.33444
H  3.668301 -0.687854 -2.131541
H  3.718781 -0.72978 1.616319
H  2.829801 -1.778993 0.527805
H  4.509912 -1.372283 0.182412
H  4.6038 2.846152 1.424968
H  4.455432 1.191373 1.985199
H  5.643907 1.594997 0.752215
H  4.843618 2.39983 -1.558921
H  3.129424 2.462032 -1.952238
H  3.795733 3.5725 -0.772566
H  -1.100421 3.163077 -0.3904
H  -1.126127 -0.247059 1.047931
H  -3.284534 2.617786 -1.303406
H  -4.840536 0.845267 -2.019138
H  -4.523084 -1.484452 -1.231943
H  -1.778247 -3.886895 2.159659
H  -0.907899 -2.066773 -1.618126
H  0.343943 -5.150235 2.03531
H  1.19512 -3.333851 -1.740809
H  1.841339 -4.875201 0.082483
totalener: -1132.67444522 hartree
nucrepener: 2309.75936586 hartree
electener: -3442.43381108 hartree
oneelecener: -6127.80984926 hartree
twoeener: 2685.37603817 hartree
kineticenergy: 1127.72160811 hartree
xcener: -110.667506444447 hartree
chargesum: 0.0000000
charge: -0.285613 -0.381513 -0.300375 -0.000626 0.101779 0.077574 -0.114956 -0.265963 -0.251288 -0.253773 -0.276816 0.320460 0.305362 0.080202 -0.248318 -0.131838 -0.177466 0.154854 -0.092838 -0.181849 0.212645 -0.197495 -0.110130 -0.086271 -0.184665 -0.144835 0.077780 0.061165 0.108952 0.091397 0.077462 0.087475 0.090552 0.091990 0.078196 0.092668 0.090008 0.103762 0.088345 0.125690 0.134166 0.110234 0.128469 0.130732 0.128519 0.136095 0.127345 0.143143 0.129606
qa: -0.2856 -0.3815 -0.3004 -0.0006 0.1018 0.0776 -0.1150 -0.2660 -0.2513 -0.2538 -0.2768 0.3205 0.3054 0.0802 -0.2483 -0.1318 -0.1775 0.1549 -0.0928 -0.1818 0.2126 -0.1975 -0.1101 -0.0863 -0.1847 -0.1448 0.0778 0.0612 0.1090 0.0914 0.0775 0.0875 0.0906 0.0920 0.0782 0.0927 0.0900 0.1038 0.0883 0.1257 0.1342 0.1102 0.1285 0.1307 0.1285 0.1361 0.1273 0.1431 0.1296
va: 2.1009 2.1126 2.1035 3.1245 3.7029 3.7741 3.9314 3.9135 3.9114 3.9031 3.9202 4.1677 3.8340 3.6686 4.0011 3.9517 4.0487 3.8946 3.9457 4.0390 3.8401 4.0267 3.8557 3.9417 3.9238 3.9150 1.0338 1.0236 1.0210 1.0003 1.0127 1.0097 1.0012 1.0061 1.0103 1.0011 0.9991 1.0174 1.0034 1.0252 1.0196 1.0111 0.9995 1.0096 1.0130 1.0054 0.9976 0.9903 0.9997
dispcorr: -0.026454523 hartree
energy: -1132.700899743461
dipole: 31.51607 -30.33997 1.17610 -3.77171 2.77648 -0.99523 -6.08530 5.24322 -0.84208
magnitude: 1.75579 au
magnitude: 4.46285 debye
