program: Gaussian 09
title: 000067420
version: EM64L-G09RevD.01
frameworkgroup: C1[X(C23H33FO2)]
method: RPBEPBE
basis: SDD
operation: Freq
keyword: #p
keyword: freq=noraman
keyword: PBEPBE/SDD
title: #p freq=noraman PBEPBE/SDD
converged: YES YES NO NO
title: Mulliken charges:
elementType: F O O C C C C C C C C C C C C C C C C C C C C C C C H H H H H H H H H H H H H H H H H H H H H H H H H H H H H H H H H
charge: -0.250694 -0.448718 -0.438841 -0.164103 0.400655 -0.175340 -0.162901 -0.517954 -0.198434 -0.560755 -0.054287 -0.499580 -0.454071 -0.821160 0.259141 -0.645853 -0.455658 0.306770 -0.390100 -0.342610 -0.554752 -0.359162 -0.447777 0.285471 -0.407563 -0.221798 0.214955 0.238182 0.219141 0.190610 0.224915 0.200902 0.206758 0.231718 0.199963 0.225201 0.191930 0.226486 0.196923 0.258205 0.216941 0.220714 0.226866 0.221764 0.223805 0.199661 0.336481 0.199277 0.182774 0.221345 0.255347 0.183111 0.225564 0.217076 0.224633 0.194093 0.352059 0.191685 0.200987
chargesum: 0.00000
title: Mulliken charges with hydrogens summed into heavy atoms:
elementType: F O O C C C C C C C C C C C C C C C C C C C C C C C
charge: -0.250694 -0.112237 -0.086782 0.050851 0.400655 0.062842 0.056240 -0.102429 0.002468 -0.122278 0.145677 -0.082449 -0.030662 -0.125299 0.259141 -0.197223 -0.032192 0.306770 -0.008048 -0.121265 -0.299405 0.049513 -0.230701 0.285471 0.011163 0.170873
polarizability: 2.64194245e+02 -3.17799811e+01 2.74880120e+02 -1.85960818e+01 -1.66932996e+01 2.01786636e+02
1716.lowfreq: -5.7958 -0.0002 0.0005 0.0007 3.6838 13.4997 17.8178 26.0018 35.4270
frequency: 17.0713 25.9415 35.3741 45.2275 67.4498 71.0015 93.4677 96.7624 113.0750 125.2566 139.3940 143.8593 162.9703 195.7987 205.9570 207.2246 229.8313 234.2111 237.3711 255.7949 266.3670 281.4966 301.3777 315.4256 334.8554 344.6400 355.8011 370.9562 375.9365 410.5850 433.4887 446.5401 457.7063 461.3327 477.3002 496.4478 507.9545 527.3924 545.2846 564.6718 569.2338 612.9470 632.6013 685.7575 707.2354 720.1972 729.7888 743.3593 771.1657 779.8075 806.6159 825.9282 834.5466 840.5855 849.6546 862.6470 872.4029 891.3841 902.7047 914.4957 928.3142 929.0873 938.3243 955.7487 960.8214 983.3431 989.8227 1004.9148 1013.1497 1020.9968 1034.9917 1041.5168 1048.9125 1058.0265 1070.8800 1081.0780 1087.7375 1096.4277 1102.4732 1113.4520 1121.2948 1136.0080 1143.9204 1147.7347 1150.6656 1164.8242 1176.2546 1178.4955 1190.6171 1191.4552 1202.5495 1215.3514 1216.6100 1230.1501 1238.0076 1244.5238 1248.2236 1253.2344 1262.3476 1266.6082 1269.2890 1280.7138 1284.7358 1291.0023 1292.1511 1297.3601 1307.5538 1315.2822 1318.9012 1322.8869 1331.0491 1335.2214 1341.2878 1349.2281 1352.7877 1368.0332 1372.2659 1375.9324 1376.7395 1383.4924 1389.7779 1397.6048 1444.2162 1444.6582 1457.3636 1459.3738 1464.1238 1466.5612 1468.8667 1469.8083 1472.2218 1479.0109 1484.3818 1491.3530 1492.4542 1495.0155 1587.8934 1631.4720 2909.7279 2913.5571 2928.0519 2950.5058 2951.8950 2957.0448 2959.3934 2962.0742 2965.2307 2970.5572 2972.2558 2984.7417 2990.1629 2996.4375 2997.1630 2999.2756 3005.1671 3019.0610 3021.6057 3030.1904 3030.5715 3041.4072 3043.0069 3049.7819 3067.6317 3072.2443 3085.0712 3096.4506 3110.4048 3140.4502 3146.0395 3570.4784 3582.9354
redmass: 6.8641 4.2489 4.0489 4.0237 3.7753 4.7225 1.9044 4.0800 3.9881 2.5138 3.1947 2.5603 3.7534 2.4886 1.6300 2.6114 3.0131 2.0212 3.1809 1.3207 2.4193 3.1691 3.3457 2.3740 3.4021 1.1191 3.1400 2.3745 3.8450 3.4028 2.9733 3.0956 3.2003 3.4338 3.7589 2.8335 2.9273 3.6225 4.8149 3.5503 2.8167 3.3482 3.1159 3.6018 3.2620 2.4702 1.2314 2.6076 1.6725 1.9661 1.9376 1.9961 2.0360 1.7086 2.3245 1.9191 1.9157 1.9934 2.1037 2.0963 1.4262 2.1518 2.2336 2.1117 2.0077 2.9247 2.1186 2.3877 2.4450 2.0477 2.8571 2.3155 2.4404 2.4274 2.3372 2.6155 1.9472 1.9374 1.8883 1.9383 1.9363 1.7910 1.6776 1.5633 1.4077 1.3328 1.8374 1.4995 1.2919 1.2547 1.8158 1.4215 1.4704 1.3735 1.4325 1.5007 1.3650 1.7041 1.9588 1.4921 1.4474 1.4680 1.3380 1.2182 1.1352 1.2434 1.3145 1.4683 1.3844 1.4308 1.4904 1.3612 1.4734 1.4781 1.5023 1.5774 1.4935 1.3182 1.4263 2.9399 1.5140 1.3678 1.0824 3.1911 1.1126 1.0752 1.0980 1.0809 1.0904 1.0926 1.0844 1.0790 1.1045 1.0769 1.0988 2.4684 7.1863 6.4980 1.0804 1.0801 1.0838 1.0606 1.0724 1.0662 1.0767 1.0623 1.0621 1.0634 1.0771 1.0603 1.0594 1.0395 1.0907 1.0589 1.0619 1.0958 1.0945 1.0979 1.0984 1.1023 1.1025 1.1026 1.1042 1.1104 1.0978 1.0992 1.0885 1.0916 1.0937 1.0662 1.0659
irintensity: 0.9324 2.2410 0.4143 0.8525 1.3179 1.5752 0.3127 0.6468 1.3542 2.0046 0.5297 2.2720 2.2007 4.7774 1.7397 0.9522 9.4479 4.7107 1.8806 88.4296 27.8311 6.3663 10.4170 1.2459 6.5716 136.9537 4.9592 1.8613 1.3279 4.6815 0.8674 3.2976 0.4995 3.6011 2.2980 4.3336 0.5018 1.0243 1.3966 2.5319 11.8415 6.2180 2.4492 2.1580 3.4584 1.6037 11.3430 3.3484 2.2763 21.9180 24.5861 5.8200 1.6968 1.8430 4.6445 15.1285 19.9414 23.0375 18.0053 1.9584 1.5878 10.9241 10.4093 30.0929 3.1844 30.0077 62.4474 31.4510 3.8480 13.7103 20.2464 5.9224 3.3254 10.0824 0.9776 8.5559 3.4949 4.4137 1.5718 35.9697 16.2875 12.5221 9.3602 37.1675 69.1123 15.7475 17.1243 48.0237 9.1763 12.8425 9.7234 3.4555 4.9703 1.2072 9.6773 8.6502 6.6352 5.8975 23.1621 3.9238 6.2105 17.7898 3.9980 9.1870 1.0758 0.3261 3.0086 5.7923 0.9427 2.4984 0.2319 1.9192 0.8025 1.4171 7.2537 2.2551 3.9217 2.4349 13.3588 21.9952 10.1812 10.7948 6.9734 7.5207 4.4172 5.5890 1.9359 7.8787 1.9726 4.2337 9.3790 2.3593 14.9499 7.8174 1.1553 108.3318 27.1290 53.3824 9.4042 3.1141 53.6698 9.8603 21.6888 35.2993 26.4705 0.8590 24.9945 18.5183 104.5587 27.6115 37.2249 21.7003 21.5473 54.7928 52.8986 21.8586 30.0752 36.8672 20.5276 49.5554 10.5173 102.3549 70.7236 61.2368 30.9882 19.0194 21.1074 14.7508 12.8349 3.3292 37.7111
temp: 298.150 k
press: 1.00000 atm
elementType: 9 8 8 6 6 6 6 6 6 6 6 6 6 6 6 6 6 6 6 6 6 6 6 6 6 6 1 1 1 1 1 1 1 1 1 1 1 1 1 1 1 1 1 1 1 1 1 1 1 1 1 1 1 1 1 1 1 1 1
symmnumber: 1
zpe: 1343724.5 jmol-1
zpe.correction: 0.511798 hartree
zpe.thermalcorrener: 0.537483 hartree
zpe.thermalcorrenthalpy: 0.538427 hartree
zpe.thermalcorrgfe: 0.455570 hartree
zpe.sumelectzpe: -1144.532238 hartree
zpe.sumelectthermal: -1144.506553 hartree
zpe.sumelectthermalent: -1144.505608 hartree
zpe.sumelectthermalfe: -1144.588466 hartree
dipole: 1.2451 -2.6967 0.1988
dipole: 2.9769
quadrupole: -179.4222 -132.7074 -157.3198
quadrupole: -2.0440 -9.7321 -11.4400
quadrupole: -22.9390 23.7758 -0.8367 -2.0440 -9.7321 -11.4400
hfenergy: -1145.0440357 hartree
pointgroup: C01 [X(C23H33F1O2)]
dipole: -0.5532874 1.0284987 0.0882205 debye
polarizability: 268.3833423|-32.1515143|270.753067|16.8487236|18.4332584|201.7245915 unknown
InChI: InChI=1S/C23H33FO2/c1-23-11-10-19-18-7-6-17(25)14-16(18)13-15(5-3-2-4-12-24)22(19)20(23)8-9-21(23)26/h6-7,14-15,19-22,25-26H,2-5,8-13H2,1H3
charge 0 multiplicity 1
59 atoms
F  5.850704 3.226869 -1.584131
O  -5.611766 1.72993 -0.629216
O  3.088026 -5.084015 0.357437
C  -2.04215 1.087561 0.172743
C  -3.453918 0.55175 -0.234658
C  -1.090537 -0.049518 0.587729
C  -0.90093 -0.999805 -0.636549
C  -3.285953 -0.392208 -1.449131
C  -4.155368 1.903653 -0.528533
C  -2.34246 2.249508 1.157482
C  0.281792 0.411009 1.158325
C  -2.272789 -1.530872 -1.151411
C  -3.702441 2.840238 0.641444
C  -4.201669 -0.174662 0.915094
C  0.123512 -2.107534 -0.350113
C  0.987614 -0.843823 1.729187
C  1.16504 1.176826 0.134843
C  1.037743 -2.00937 0.743494
C  2.356188 1.92793 0.773346
C  0.233957 -3.230162 -1.20943
C  2.008639 -3.017581 0.944434
C  3.188747 2.716274 -0.262047
C  1.198155 -4.239349 -1.010385
C  2.090125 -4.127402 0.080919
C  4.393388 3.448512 0.368097
C  5.253655 4.193542 -0.648608
H  -1.615811 1.548225 -0.748274
H  -1.580153 -0.628815 1.400822
H  -0.485167 -0.372657 -1.4589
H  -2.920875 0.198175 -2.316722
H  -4.262188 -0.824005 -1.741813
H  -3.76654 2.300885 -1.494284
H  -1.53463 3.003188 1.16261
H  -2.441371 1.87374 2.193619
H  0.080399 1.100226 2.006016
H  -2.690347 -2.236521 -0.406711
H  -2.12798 -2.114083 -2.080369
H  -4.473814 2.813113 1.433343
H  -3.60002 3.890424 0.311075
H  -5.248464 -0.346225 0.61259
H  -3.742919 -1.149378 1.151462
H  -4.220511 0.420777 1.845154
H  0.440218 -1.171771 2.637805
H  2.014116 -0.602936 2.06459
H  1.554496 0.473077 -0.628073
H  0.540752 1.915326 -0.408969
H  -6.02574 2.602837 -0.844143
H  3.021791 1.20916 1.293221
H  1.976981 2.623323 1.55269
H  -0.443394 -3.326222 -2.064677
H  2.718041 -2.94945 1.776606
H  2.536144 3.453306 -0.776154
H  3.559797 2.025233 -1.043804
H  1.255258 -5.095145 -1.695963
H  5.029856 2.723118 0.911952
H  4.037332 4.18578 1.118742
H  3.06615 -5.81208 -0.311898
H  4.657423 4.894075 -1.264027
H  6.098667 4.724398 -0.172578
