program: Orca
programVersion: 5.0.2
elementType: O O O N C C C C C C C C C C C C C C C C C C C C C C H H H H H H H H H H H H H H H H H H H H H H H
charge: 0
multiplicity: 1
keywords: wb97x-d3
keywords: def2-TZVPP
keywords: def2/J RIJCOSX
keywords: DEFGRID2
keywords: scfconv7
keywords: smallprint printgap noloewdin
keywords: NOSOSCF
formula: C22H23NO3
InChI: InChI=1/C22H23NO3/c1-21(2)19(22(21,3)4)20(24)26-18(14-23)15-9-8-12-17(13-15)25-16-10-6-5-7-11-16/h5-13,18-19H,1-4H3
49 atoms
O  0.88581 1.484374 -1.159157
O  2.226224 0.908352 0.537225
O  -2.979221 -2.378644 1.441706
N  -0.363004 -0.417726 -3.580706
C  2.898576 3.96439 0.715303
C  3.827555 3.482835 -0.354318
C  2.346565 3.114356 -0.423153
C  2.991341 3.417115 2.121946
C  2.444084 5.408835 0.730398
C  4.315232 4.435447 -1.424944
C  4.870033 2.429763 -0.053809
C  1.860435 1.736468 -0.249477
C  0.294904 0.203229 -1.128154
C  -0.943844 0.146278 -0.259042
C  -0.062865 -0.121548 -2.512374
C  -1.35535 -1.094093 0.206506
C  -1.684253 1.285138 0.018396
C  -2.530019 -1.199172 0.939268
C  -2.839066 1.170232 0.778325
C  -3.272911 -0.06282 1.23247
C  -2.77727 -3.542943 0.753649
C  -2.401857 -4.657901 1.487577
C  -2.99229 -3.637086 -0.615964
C  -2.240116 -5.875681 0.844452
C  -2.81436 -4.85792 -1.2474
C  -2.438451 -5.980636 -0.523779
H  1.784618 3.663922 -1.170229
H  2.023267 3.492695 2.619886
H  3.302926 2.380636 2.184843
H  3.700681 4.016984 2.695496
H  2.262849 5.820797 -0.260263
H  1.514225 5.502785 1.29352
H  3.189037 6.039377 1.219529
H  3.555519 5.138249 -1.760155
H  5.167107 5.014583 -1.063021
H  4.646137 3.877108 -2.302007
H  4.571661 1.698208 0.6896
H  5.125365 1.882756 -0.963061
H  5.78204 2.913773 0.300832
H  1.013894 -0.547375 -0.782228
H  -0.763466 -1.976824 -0.00537
H  -1.372957 2.252152 -0.350875
H  -3.420287 2.053793 1.005608
H  -4.180803 -0.154717 1.81356
H  -2.244036 -4.566454 2.554099
H  -3.295267 -2.769205 -1.187716
H  -1.949252 -6.745066 1.419013
H  -2.977933 -4.929467 -2.314423
H  -2.304248 -6.930361 -1.023289
totalener: -1132.67469004 hartree
nucrepener: 2192.83474595 hartree
electener: -3325.50943599 hartree
oneelecener: -5894.21051913 hartree
twoeener: 2568.70108314 hartree
kineticenergy: 1127.72068568 hartree
xcener: -110.667056793506 hartree
chargesum: -0.0000000
charge: -0.285749 -0.382442 -0.297591 -0.005115 0.090000 0.074769 -0.123687 -0.270015 -0.257401 -0.253238 -0.276162 0.331251 0.305789 0.092697 -0.242998 -0.205472 -0.184537 0.225066 -0.096867 -0.192769 0.249063 -0.212738 -0.175017 -0.088384 -0.108324 -0.145900 0.076379 0.087747 0.106090 0.087720 0.078424 0.090017 0.093084 0.077502 0.093727 0.091642 0.103582 0.089446 0.090745 0.123413 0.118717 0.125404 0.126245 0.128518 0.125534 0.137538 0.126323 0.131598 0.126374
qa: -0.2857 -0.3824 -0.2976 -0.0051 0.0900 0.0748 -0.1237 -0.2700 -0.2574 -0.2532 -0.2762 0.3313 0.3058 0.0927 -0.2430 -0.2055 -0.1845 0.2251 -0.0969 -0.1928 0.2491 -0.2127 -0.1750 -0.0884 -0.1083 -0.1459 0.0764 0.0877 0.1061 0.0877 0.0784 0.0900 0.0931 0.0775 0.0937 0.0916 0.1036 0.0894 0.0907 0.1234 0.1187 0.1254 0.1262 0.1285 0.1255 0.1375 0.1263 0.1316 0.1264
va: 2.1037 2.1144 2.1155 3.1239 3.7177 3.7577 3.9240 3.9192 3.9090 3.9049 3.9252 4.1626 3.8234 3.6931 3.9958 4.0017 4.0109 3.8670 3.9560 4.0331 3.7915 4.0447 3.9500 3.9288 3.9451 3.9627 1.0332 1.0033 1.0171 0.9991 1.0096 1.0059 1.0018 1.0103 1.0005 1.0063 1.0167 1.0031 0.9993 1.0312 1.0129 1.0186 1.0006 1.0116 1.0139 1.0031 0.9987 0.9990 1.0003
dispcorr: -0.023326343 hartree
energy: -1132.698016385548
dipole: 24.05408 -23.64194 0.41213 24.27999 -23.43890 0.84109 5.55517 -4.70061 0.85457
magnitude: 1.26790 au
magnitude: 3.22275 debye
