program: Orca
programVersion: 5.0.2
elementType: O O O N C C C C C C C C C C C C C C C C C C C C C C H H H H H H H H H H H H H H H H H H H H H H H
charge: 0
multiplicity: 1
keywords: wb97x-d3
keywords: def2-TZVPP
keywords: def2/J RIJCOSX
keywords: DEFGRID2
keywords: scfconv7
keywords: smallprint printgap noloewdin
keywords: NOSOSCF
formula: C22H23NO3
InChI: InChI=1/C22H23NO3/c1-21(2)19(22(21,3)4)20(24)26-18(14-23)15-9-8-12-17(13-15)25-16-10-6-5-7-11-16/h5-13,18-19H,1-4H3
49 atoms
O  0.78709 1.337427 0.451818
O  0.805006 3.042438 -0.996071
O  -2.352207 -2.919265 -0.60608
N  -1.102087 1.019467 3.160971
C  3.632016 1.998781 -1.815689
C  3.933523 2.843273 -0.617201
C  2.818386 1.80365 -0.542135
C  3.011814 2.609004 -3.052449
C  4.547549 0.850954 -2.187667
C  5.156617 2.557964 0.227372
C  3.608775 4.319963 -0.613433
C  1.395178 2.16203 -0.428649
C  -0.611444 1.512224 0.641874
C  -1.396036 0.600587 -0.269413
C  -0.871577 1.228824 2.05533
C  -1.514175 -0.75016 0.034053
C  -1.94936 1.112337 -1.434418
C  -2.212806 -1.586223 -0.825402
C  -2.630945 0.262738 -2.293693
C  -2.771667 -1.080349 -1.993459
C  -2.398017 -3.406836 0.671859
C  -3.229098 -2.852072 1.636867
C  -1.623837 -4.519589 0.96109
C  -3.271432 -3.418027 2.901013
C  -1.685703 -5.083565 2.226646
C  -2.502963 -4.53357 3.202105
H  3.069793 0.91565 0.027309
H  2.34544 3.442569 -2.861915
H  3.805142 2.958538 -3.716148
H  2.43978 1.856245 -3.597426
H  4.940807 0.309588 -1.329702
H  4.009534 0.128839 -2.803815
H  5.397489 1.211832 -2.770133
H  6.037631 3.040149 -0.200768
H  5.019842 2.957354 1.233531
H  5.378132 1.497906 0.330519
H  2.710326 4.584645 -1.16053
H  3.479474 4.672822 0.411235
H  4.441213 4.877748 -1.046569
H  -0.896295 2.551636 0.45428
H  -1.075306 -1.145201 0.942615
H  -1.840651 2.161634 -1.673304
H  -3.067074 0.653166 -3.203273
H  -3.312945 -1.744427 -2.654399
H  -3.837578 -1.986694 1.407261
H  -0.984589 -4.939143 0.195538
H  -3.914035 -2.982322 3.654267
H  -1.083415 -5.953959 2.450696
H  -2.541855 -4.970616 4.190506
totalener: -1132.67608506 hartree
nucrepener: 2214.91689982 hartree
electener: -3347.59298488 hartree
oneelecener: -5938.58601874 hartree
twoeener: 2590.99303386 hartree
kineticenergy: 1127.72433923 hartree
xcener: -110.667132499616 hartree
chargesum: 0.0000000
charge: -0.266708 -0.403249 -0.297842 -0.006832 0.081749 0.079083 -0.120924 -0.271896 -0.256486 -0.254778 -0.278210 0.361854 0.332244 0.008278 -0.261703 -0.182457 -0.143611 0.214489 -0.092802 -0.199883 0.239016 -0.161596 -0.207071 -0.100945 -0.093192 -0.140801 0.075417 0.103649 0.087663 0.088727 0.077564 0.091174 0.092439 0.091956 0.092090 0.077784 0.103901 0.089224 0.090132 0.118825 0.127498 0.124448 0.127600 0.128218 0.131946 0.124774 0.128184 0.125274 0.125785
qa: -0.2667 -0.4032 -0.2978 -0.0068 0.0817 0.0791 -0.1209 -0.2719 -0.2565 -0.2548 -0.2782 0.3619 0.3322 0.0083 -0.2617 -0.1825 -0.1436 0.2145 -0.0928 -0.1999 0.2390 -0.1616 -0.2071 -0.1009 -0.0932 -0.1408 0.0754 0.1036 0.0877 0.0887 0.0776 0.0912 0.0924 0.0920 0.0921 0.0778 0.1039 0.0892 0.0901 0.1188 0.1275 0.1244 0.1276 0.1282 0.1319 0.1248 0.1282 0.1253 0.1258
va: 2.1286 2.0884 2.1134 3.1164 3.7267 3.7319 3.9341 3.9201 3.9073 3.9060 3.9227 4.1557 3.8165 3.6957 4.0289 3.9899 3.9726 3.8634 3.9523 4.0355 3.8067 3.9573 4.0425 3.9505 3.9332 3.9641 1.0338 1.0170 0.9994 1.0033 1.0106 1.0057 1.0011 1.0010 1.0059 1.0103 1.0171 1.0029 0.9993 1.0261 1.0162 1.0199 0.9997 1.0118 1.0033 1.0134 0.9999 0.9990 1.0003
dispcorr: -0.023573636 hartree
energy: -1132.699658698416
dipole: 28.84080 -28.08472 0.75608 12.54769 -12.71099 -0.16330 -10.73876 9.74810 -0.99066
magnitude: 1.25687 au
magnitude: 3.19471 debye
