program: Orca
programVersion: 5.0.2
elementType: O O O N C C C C C C C C C C C C C C C C C C C C C C H H H H H H H H H H H H H H H H H H H H H H H
charge: 0
multiplicity: 1
keywords: wb97x-d3
keywords: def2-TZVPP
keywords: def2/J RIJCOSX
keywords: DEFGRID2
keywords: scfconv7
keywords: smallprint printgap noloewdin
keywords: NOSOSCF
formula: C22H23NO3
InChI: InChI=1/C22H23NO3/c1-21(2)19(22(21,3)4)20(24)26-18(14-23)15-9-8-12-17(13-15)25-16-10-6-5-7-11-16/h5-13,18-19H,1-4H3
49 atoms
O  0.390843 1.745195 0.875261
O  0.674918 2.650333 -1.145753
O  -2.032848 -2.457883 -0.832221
N  -1.943258 1.896224 3.21421
C  3.207694 0.730407 -1.137341
C  3.726128 2.080899 -0.750706
C  2.500291 1.527245 -0.041017
C  2.538485 0.51851 -2.47637
C  3.921187 -0.52464 -0.682618
C  4.972852 2.196977 0.101775
C  3.622839 3.247859 -1.707285
C  1.135842 2.049902 -0.214415
C  -0.985627 2.064063 0.787927
C  -1.737288 1.122326 -0.125188
C  -1.503884 1.965475 2.155389
C  -1.515783 -0.24482 -0.020517
C  -2.642177 1.623636 -1.045624
C  -2.22142 -1.11198 -0.842769
C  -3.340417 0.746646 -1.862317
C  -3.138439 -0.617978 -1.763938
C  -1.644839 -3.090974 0.31616
C  -0.618673 -4.018162 0.220629
C  -2.285356 -2.865761 1.528249
C  -0.232868 -4.728051 1.348017
C  -1.881119 -3.572968 2.649302
C  -0.856445 -4.505122 2.565879
H  2.68139 1.158763 0.962858
H  1.958242 1.364005 -2.830189
H  3.294625 0.293332 -3.230527
H  1.862405 -0.336464 -2.426133
H  3.230538 -1.369489 -0.6835
H  4.739542 -0.768026 -1.363034
H  4.336414 -0.451351 0.320401
H  5.869349 2.122776 -0.516371
H  4.996698 3.167841 0.598788
H  5.044045 1.438541 0.878754
H  3.591546 4.18748 -1.153501
H  4.512902 3.272164 -2.339227
H  2.753866 3.228011 -2.355119
H  -1.128413 3.095055 0.446889
H  -0.79933 -0.628063 0.695685
H  -2.794874 2.691197 -1.13451
H  -4.047555 1.130466 -2.585042
H  -3.679483 -1.307843 -2.397765
H  -0.136517 -4.184549 -0.733709
H  -3.091154 -2.146278 1.599846
H  0.565191 -5.454627 1.271356
H  -2.376982 -3.39462 3.594018
H  -0.548897 -5.055452 3.444519
totalener: -1132.67481587 hartree
nucrepener: 2276.74401113 hartree
electener: -3409.41882700 hartree
oneelecener: -6062.11304464 hartree
twoeener: 2652.69421765 hartree
kineticenergy: 1127.73006402 hartree
xcener: -110.667842597505 hartree
chargesum: -0.0000000
charge: -0.277189 -0.375332 -0.298106 -0.004790 0.074870 0.095903 -0.115989 -0.274824 -0.252347 -0.257583 -0.270628 0.313947 0.326294 0.059394 -0.256268 -0.217641 -0.153255 0.233980 -0.084723 -0.207964 0.255978 -0.218551 -0.175129 -0.089716 -0.104850 -0.144847 0.078203 0.105006 0.091708 0.087660 0.089390 0.092505 0.077554 0.092855 0.090974 0.077845 0.087525 0.086406 0.103099 0.121358 0.132059 0.105114 0.126325 0.128287 0.124952 0.136172 0.125608 0.131720 0.127040
qa: -0.2772 -0.3753 -0.2981 -0.0048 0.0749 0.0959 -0.1160 -0.2748 -0.2523 -0.2576 -0.2706 0.3139 0.3263 0.0594 -0.2563 -0.2176 -0.1533 0.2340 -0.0847 -0.2080 0.2560 -0.2186 -0.1751 -0.0897 -0.1049 -0.1448 0.0782 0.1050 0.0917 0.0877 0.0894 0.0925 0.0776 0.0929 0.0910 0.0778 0.0875 0.0864 0.1031 0.1214 0.1321 0.1051 0.1263 0.1283 0.1250 0.1362 0.1256 0.1317 0.1270
va: 2.1125 2.1204 2.1148 3.1241 3.7555 3.7273 3.9194 3.9237 3.9031 3.9055 3.9167 4.1969 3.8384 3.6562 4.0238 3.9417 4.0356 3.8285 3.9539 4.0378 3.7864 4.0423 3.9609 3.9270 3.9449 3.9639 1.0331 1.0169 0.9995 1.0040 1.0070 1.0010 1.0104 1.0011 1.0059 1.0096 1.0037 0.9992 1.0181 1.0207 1.0226 1.0139 1.0000 1.0118 1.0140 1.0033 0.9989 0.9990 1.0002
dispcorr: -0.024561274 hartree
energy: -1132.699377142351
dipole: 28.86197 -27.86794 0.99404 2.29356 -2.74608 -0.45251 -9.65360 8.80013 -0.85347
magnitude: 1.38610 au
magnitude: 3.52320 debye
