program: Orca
programVersion: 5.0.2
elementType: O O O N C C C C C C C C C C C C C C C C C C C C C C H H H H H H H H H H H H H H H H H H H H H H H
charge: 0
multiplicity: 1
keywords: wb97x-d3
keywords: def2-TZVPP
keywords: def2/J RIJCOSX
keywords: DEFGRID2
keywords: scfconv7
keywords: smallprint printgap noloewdin
keywords: NOSOSCF
formula: C22H23NO3
InChI: InChI=1/C22H23NO3/c1-21(2)19(22(21,3)4)20(24)26-18(14-23)15-9-8-12-17(13-15)25-16-10-6-5-7-11-16/h5-13,18-19H,1-4H3
49 atoms
O  0.615448 1.492348 0.75516
O  0.748914 2.83671 -1.023889
O  -2.327714 -2.623772 -0.743712
N  -1.475044 1.320104 3.31192
C  3.481926 1.348337 -1.518139
C  3.851289 2.530905 -0.678838
C  2.690991 1.641671 -0.246288
C  2.849736 1.534642 -2.879287
C  4.336065 0.098531 -1.487156
C  5.078685 2.478292 0.206804
C  3.610189 3.937725 -1.178537
C  1.28566 2.078557 -0.261879
C  -0.774809 1.769064 0.833952
C  -1.575838 0.907063 -0.111976
C  -1.15153 1.512511 2.22694
C  -1.565349 -0.473684 0.052182
C  -2.289947 1.490994 -1.145211
C  -2.300583 -1.26807 -0.815249
C  -3.014404 0.684594 -2.011715
C  -3.027587 -0.688043 -1.850395
C  -2.08032 -3.260124 0.442092
C  -1.135219 -4.27364 0.443581
C  -2.787925 -2.948109 1.595946
C  -0.901163 -4.986521 1.610124
C  -2.534916 -3.65911 2.757926
C  -1.594379 -4.67968 2.770845
H  2.913221 0.97968 0.583432
H  2.246393 0.662083 -3.13585
H  2.207305 2.404382 -2.963935
H  3.633818 1.622464 -3.633964
H  5.191077 0.20384 -2.157881
H  4.720093 -0.14338 -0.49827
H  3.755636 -0.760875 -1.826334
H  4.994047 3.215247 1.006992
H  5.235708 1.51039 0.678419
H  5.976322 2.717061 -0.366918
H  2.72811 4.051412 -1.798978
H  3.502529 4.622407 -0.335406
H  4.474409 4.268618 -1.757987
H  -0.972119 2.824958 0.623344
H  -0.994687 -0.921094 0.857241
H  -2.273893 2.563946 -1.280729
H  -3.577323 1.131464 -2.820015
H  -3.595057 -1.321231 -2.519609
H  -0.597493 -4.503591 -0.466805
H  -3.527602 -2.157523 1.589203
H  -0.167265 -5.781622 1.609818
H  -3.08217 -3.413612 3.658182
H  -1.404921 -5.232386 3.68088
totalener: -1132.67575967 hartree
nucrepener: 2240.75419775 hartree
electener: -3373.42995743 hartree
oneelecener: -5990.26491177 hartree
twoeener: 2616.83495434 hartree
kineticenergy: 1127.72532641 hartree
xcener: -110.666850333182 hartree
chargesum: -0.0000000
charge: -0.270950 -0.393396 -0.296891 -0.006275 0.080220 0.082002 -0.117125 -0.274497 -0.255778 -0.255585 -0.274452 0.344900 0.340393 0.008203 -0.264286 -0.190953 -0.136393 0.228975 -0.087558 -0.208657 0.242714 -0.203676 -0.170523 -0.095690 -0.102707 -0.139884 0.077283 0.089719 0.104410 0.089277 0.092644 0.077816 0.090560 0.090977 0.077950 0.092287 0.104769 0.087489 0.087978 0.116081 0.129246 0.112311 0.126763 0.127636 0.124870 0.134668 0.125567 0.130692 0.126875
qa: -0.2709 -0.3934 -0.2969 -0.0063 0.0802 0.0820 -0.1171 -0.2745 -0.2558 -0.2556 -0.2745 0.3449 0.3404 0.0082 -0.2643 -0.1910 -0.1364 0.2290 -0.0876 -0.2087 0.2427 -0.2037 -0.1705 -0.0957 -0.1027 -0.1399 0.0773 0.0897 0.1044 0.0893 0.0926 0.0778 0.0906 0.0910 0.0780 0.0923 0.1048 0.0875 0.0880 0.1161 0.1292 0.1123 0.1268 0.1276 0.1249 0.1347 0.1256 0.1307 0.1269
va: 2.1316 2.1025 2.1161 3.1221 3.7327 3.7269 3.9347 3.9229 3.9056 3.9069 3.9196 4.1661 3.8363 3.6698 4.0250 3.9614 3.9979 3.8484 3.9552 4.0349 3.7996 4.0451 3.9705 3.9319 3.9469 3.9606 1.0331 1.0030 1.0165 0.9990 1.0008 1.0104 1.0062 1.0060 1.0101 1.0013 1.0174 1.0033 0.9994 1.0212 1.0196 1.0191 0.9998 1.0123 1.0133 1.0032 0.9992 0.9994 1.0002
dispcorr: -0.023852041 hartree
energy: -1132.699611714403
dipole: 29.36299 -28.46294 0.90005 7.82114 -8.09013 -0.26899 -10.81509 9.88158 -0.93351
magnitude: 1.32435 au
magnitude: 3.36622 debye
