program: Orca
programVersion: 5.0.2
elementType: O O O N C C C C C C C C C C C C C C C C C C C C C C H H H H H H H H H H H H H H H H H H H H H H H
charge: 0
multiplicity: 1
keywords: wb97x-d3
keywords: def2-TZVPP
keywords: def2/J RIJCOSX
keywords: DEFGRID2
keywords: scfconv7
keywords: smallprint printgap noloewdin
keywords: NOSOSCF
formula: C22H23NO3
InChI: InChI=1/C22H23NO3/c1-21(2)19(22(21,3)4)20(24)26-18(14-23)15-9-8-12-17(13-15)25-16-10-6-5-7-11-16/h5-13,18-19H,1-4H3
49 atoms
O  0.006741 1.992661 0.639503
O  0.888811 2.060784 -1.417828
O  -2.253997 -2.255468 -0.917528
N  -2.136602 4.194906 1.857947
C  2.934075 0.067165 0.037621
C  3.624639 1.388045 -0.102122
C  2.215416 1.350482 0.463952
C  2.465757 -0.68947 -1.185444
C  3.313238 -0.883921 1.15112
C  4.705525 1.781344 0.883546
C  3.915475 1.963562 -1.470809
C  1.023689 1.839698 -0.246239
C  -1.23584 2.44132 0.141577
C  -2.218399 1.303959 -0.072513
C  -1.736166 3.416287 1.114739
C  -1.752108 0.024255 -0.333809
C  -3.583595 1.562577 -0.087383
C  -2.6574 -0.994609 -0.601913
C  -4.474322 0.538333 -0.365072
C  -4.021288 -0.74513 -0.618067
C  -1.170389 -2.816647 -0.308421
C  -0.329478 -3.586557 -1.099467
C  -0.935127 -2.690872 1.055789
C  0.746788 -4.240601 -0.519868
C  0.150149 -3.343774 1.619841
C  0.994814 -4.120236 0.839164
H  2.143639 1.482445 1.538171
H  3.289831 -1.282205 -1.587853
H  1.671912 -1.388612 -0.913807
H  2.090109 -0.061791 -1.988058
H  3.560652 -0.384712 2.085765
H  2.489018 -1.569435 1.354211
H  4.176184 -1.486166 0.8592
H  4.490392 1.485873 1.908457
H  5.662086 1.335838 0.603478
H  4.834475 2.864855 0.882871
H  3.191501 1.704639 -2.235054
H  3.957695 3.052984 -1.422208
H  4.895011 1.613016 -1.803801
H  -1.094054 2.96374 -0.811856
H  -0.694432 -0.199642 -0.334532
H  -3.959166 2.5556 0.123847
H  -5.536771 0.740857 -0.372343
H  -4.711774 -1.550597 -0.829585
H  -0.528328 -3.674339 -2.159372
H  -1.595018 -2.097827 1.675846
H  1.398043 -4.842681 -1.139353
H  0.328531 -3.250425 2.683059
H  1.836461 -4.629736 1.288179
totalener: -1132.67431458 hartree
nucrepener: 2326.08397856 hartree
electener: -3458.75829314 hartree
oneelecener: -6160.37336020 hartree
twoeener: 2701.61506706 hartree
kineticenergy: 1127.71069677 hartree
xcener: -110.669207700232 hartree
chargesum: -0.0000000
charge: -0.267604 -0.368569 -0.295761 -0.006846 0.102910 0.106736 -0.124414 -0.253021 -0.252712 -0.260968 -0.272247 0.281711 0.351539 -0.013286 -0.241356 -0.131392 -0.199487 0.246640 -0.082800 -0.203549 0.235049 -0.186341 -0.152649 -0.090852 -0.126245 -0.159215 0.075899 0.099283 0.028443 0.111571 0.080928 0.078760 0.093330 0.077506 0.092806 0.092948 0.101599 0.089809 0.085818 0.125003 0.103708 0.122803 0.129145 0.127833 0.125007 0.133802 0.125076 0.134768 0.128889
qa: -0.2676 -0.3686 -0.2958 -0.0068 0.1029 0.1067 -0.1244 -0.2530 -0.2527 -0.2610 -0.2722 0.2817 0.3515 -0.0133 -0.2414 -0.1314 -0.1995 0.2466 -0.0828 -0.2035 0.2350 -0.1863 -0.1526 -0.0909 -0.1262 -0.1592 0.0759 0.0993 0.0284 0.1116 0.0809 0.0788 0.0933 0.0775 0.0928 0.0929 0.1016 0.0898 0.0858 0.1250 0.1037 0.1228 0.1291 0.1278 0.1250 0.1338 0.1251 0.1348 0.1289
va: 2.1074 2.1220 2.1204 3.1125 3.7109 3.7272 3.9339 3.9127 3.8977 3.9049 3.9164 4.2181 3.7767 3.8053 3.9976 3.9479 4.0352 3.8156 3.9622 4.0378 3.8057 3.9739 3.9153 3.8844 3.8836 3.8991 1.0354 1.0029 1.0296 1.0179 1.0140 1.0219 1.0014 1.0102 1.0009 1.0055 1.0178 1.0041 0.9988 1.0232 0.9990 1.0192 0.9998 1.0130 1.0151 1.0028 0.9996 0.9987 1.0004
dispcorr: -0.027679979 hartree
energy: -1132.701994554398
dipole: 29.63119 -28.69453 0.93666 -6.38007 4.99675 -1.38332 -0.68737 0.48010 -0.20727
magnitude: 1.68341 au
magnitude: 4.27889 debye
