program: Orca
programVersion: 5.0.2
elementType: Cl Cl O O N C C C C C C C C C C C C C C H H H H H H H H H H H H H H H H H
charge: 0
multiplicity: 1
keywords: wb97x-d3
keywords: def2-TZVPP
keywords: def2/J RIJCOSX
keywords: DEFGRID2
keywords: scfconv7
keywords: smallprint printgap noloewdin
keywords: NOSOSCF
formula: C14H17Cl2NO2
InChI: InChI=1/C14H17Cl2NO2/c1-14(7-3-2-4-8-14)13(19)17-9-5-6-10(18)12(16)11(9)15/h5-6,17-18H,2-4,7-8H2,1H3
36 atoms
Cl -1.415635 -2.103845 -0.174669
Cl -4.308589 -1.10432 0.214445
O  1.881151 1.876991 -0.618979
O  -4.543885 1.886487 0.34848
N  0.64353 -0.006441 -0.371148
C  3.040336 -0.24128 -0.758639
C  4.325047 0.580884 -0.585979
C  3.090479 -1.41592 0.23355
C  4.57988 1.028852 0.850542
C  3.281905 -0.963236 1.675748
C  4.560027 -0.145988 1.821265
C  2.965338 -0.777697 -2.194185
C  1.81544 0.662612 -0.557363
C  -0.645647 0.496992 -0.202172
C  -1.709845 -0.404445 -0.090869
C  -0.955148 1.856646 -0.122894
C  -3.018512 0.034034 0.089997
C  -2.253513 2.28757 0.059241
C  -3.3099 1.393197 0.17073
H  4.32228 1.440114 -1.259229
H  5.155927 -0.05526 -0.908896
H  3.940096 -2.042256 -0.057926
H  2.218588 -2.071905 0.14553
H  3.83274 1.766071 1.154198
H  5.545943 1.537345 0.900353
H  3.315672 -1.837107 2.330759
H  2.421331 -0.369326 2.002787
H  5.421881 -0.793479 1.62681
H  4.666148 0.211776 2.848387
H  3.84924 -1.38061 -2.40811
H  2.089691 -1.410062 -2.352623
H  2.932122 0.032851 -2.924368
H  0.713967 -1.011893 -0.379436
H  -0.176212 2.595155 -0.20192
H  -2.45803 3.348726 0.117474
H  -5.209566 1.190878 0.416653
elementType: Cl O N C H
totalener: -1669.48120683 hartree
nucrepener: 1738.95581174 hartree
electener: -3408.43701857 hartree
oneelecener: -5745.94861753 hartree
twoeener: 2337.51159896 hartree
cpcmener: -0.01898581 hartree
kineticenergy: 1664.78871229 hartree
xcener: -115.363201755551 hartree
chargesum: -0.0000000
charge: -0.073191 -0.071773 -0.488049 -0.333868 -0.155593 0.361196 -0.253672 -0.241149 -0.140408 -0.118895 -0.135397 -0.326029 0.208154 0.193879 -0.089872 -0.215723 0.058009 -0.150069 0.175789 0.083557 0.089080 0.087974 0.081865 0.071686 0.076138 0.080375 0.063248 0.065058 0.074657 0.101376 0.100578 0.112150 0.169784 0.160953 0.142622 0.235561
qa: -0.0732 -0.0718 -0.4880 -0.3339 -0.1556 0.3612 -0.2537 -0.2411 -0.1404 -0.1189 -0.1354 -0.3260 0.2082 0.1939 -0.0899 -0.2157 0.0580 -0.1501 0.1758 0.0836 0.0891 0.0880 0.0819 0.0717 0.0761 0.0804 0.0632 0.0651 0.0747 0.1014 0.1006 0.1122 0.1698 0.1610 0.1426 0.2356
va: 1.2724 1.2683 2.0245 2.1586 3.2349 3.5666 3.9151 3.9399 3.8829 3.8786 3.8978 3.9198 4.2085 3.7757 3.9669 3.9999 3.8110 3.9644 4.0307 1.0267 1.0098 1.0121 1.0181 1.0236 1.0119 1.0100 1.0203 1.0105 1.0125 1.0030 1.0110 1.0041 1.0383 1.0342 1.0063 1.0239
dispcorr: -0.018338541 hartree
energy: -1669.499545374909
dipole: 47.78319 -47.65430 0.12889 5.42840 -6.82959 -1.40119 1.03105 -0.92323 0.10782
magnitude: 1.41123 au
magnitude: 3.58705 debye
