program: Orca
programVersion: 5.0.2
elementType: O O C C C C C C C C C C C C C C C C C C H H H H H H H H H H H H H H H H H H H H H H H H H H
charge: 0
multiplicity: 1
keywords: wb97x-d3
keywords: def2-TZVPP
keywords: def2/J RIJCOSX
keywords: DEFGRID2
keywords: scfconv7
keywords: smallprint printgap noloewdin
keywords: NOSOSCF
formula: C18H26O2
InChI: InChI=1/C18H26O2/c1-8-10-13(5)15(9-2)20-17(19)16-14(11-12(3)4)18(16,6)7/h2,10-11,14-16H,8H2,1,3-7H3
46 atoms
O  -1.017645 -1.096563 -0.375043
O  -0.293939 0.15298 1.336714
C  1.919953 0.920251 -0.761825
C  2.478476 -0.056665 0.226229
C  1.179482 -0.379106 -0.473613
C  1.394962 2.24009 -0.255644
C  2.551872 1.01712 -2.12833
C  3.680956 -0.873298 -0.06881
C  -0.087145 -0.38994 0.275945
C  4.903739 -0.637204 0.4149
C  5.232556 0.506246 1.324982
C  6.061851 -1.519893 0.062434
C  -2.345962 -1.142257 0.184233
C  -3.119941 0.096052 -0.188477
C  -2.963768 -2.34736 -0.360841
C  -3.388614 0.318455 -1.649877
C  -3.527421 0.918717 0.777694
C  -4.31088 2.178159 0.57742
C  -3.506904 -3.326047 -0.795186
C  -5.212602 2.494358 1.763314
H  2.364203 0.250639 1.261633
H  1.234485 -1.11329 -1.270215
H  1.070872 2.204486 0.781915
H  2.185353 2.990406 -0.320916
H  0.558279 2.59361 -0.86147
H  1.854089 1.458517 -2.842195
H  3.437261 1.65513 -2.093264
H  2.857389 0.047494 -2.519986
H  3.546556 -1.717651 -0.738815
H  6.01996 1.12555 0.887962
H  4.382385 1.153149 1.533914
H  5.623024 0.143941 2.279352
H  6.850768 -0.949315 -0.434283
H  6.513177 -1.952098 0.959231
H  5.770356 -2.337845 -0.59605
H  -2.291015 -1.239345 1.27192
H  -3.267921 1.36542 -1.926119
H  -2.715275 -0.260643 -2.281448
H  -4.406518 0.027761 -1.919158
H  -3.273366 0.673448 1.806097
H  -4.906636 2.116954 -0.335482
H  -3.614838 3.010803 0.426862
H  -3.986687 -4.198142 -1.180538
H  -5.765798 3.41867 1.597445
H  -5.939527 1.699376 1.934828
H  -4.632881 2.616484 2.679436
elementType: O C H
totalener: -851.99810895 hartree
nucrepener: 1530.37276279 hartree
electener: -2382.37087174 hartree
oneelecener: -4194.50445223 hartree
twoeener: 1812.13358049 hartree
cpcmener: -0.02488890 hartree
kineticenergy: 847.98363264 hartree
xcener: -85.215270199338 hartree
chargesum: -0.0000000
charge: -0.292205 -0.493175 0.154377 -0.001008 -0.143110 -0.300108 -0.267601 -0.273239 0.427210 -0.032063 -0.250938 -0.229356 0.160871 -0.114864 -0.523479 -0.299069 -0.104257 -0.078031 0.204912 -0.265848 0.098021 0.093476 0.093023 0.098200 0.102905 0.099252 0.096442 0.091714 0.124351 0.096381 0.087654 0.099108 0.094766 0.094591 0.089590 0.125735 0.110312 0.099122 0.114802 0.112409 0.074713 0.079495 0.286660 0.089837 0.084726 0.083696
qa: -0.2922 -0.4932 0.1544 -0.0010 -0.1431 -0.3001 -0.2676 -0.2732 0.4272 -0.0321 -0.2509 -0.2294 0.1609 -0.1149 -0.5235 -0.2991 -0.1043 -0.0780 0.2049 -0.2658 0.0980 0.0935 0.0930 0.0982 0.1029 0.0993 0.0964 0.0917 0.1244 0.0964 0.0877 0.0991 0.0948 0.0946 0.0896 0.1257 0.1103 0.0991 0.1148 0.1124 0.0747 0.0795 0.2867 0.0898 0.0847 0.0837
va: 2.1101 2.0157 3.6571 3.7792 3.9091 3.9020 3.9056 3.8715 4.1627 3.7029 3.9423 3.9266 3.8552 3.6465 3.9494 3.9479 3.8583 3.9054 3.4074 3.9448 1.0244 1.0385 1.0176 1.0008 0.9986 1.0026 1.0026 1.0027 1.0066 0.9973 1.0079 0.9979 0.9960 0.9953 1.0077 1.0223 0.9962 1.0156 0.9917 1.0141 1.0031 1.0034 0.9449 1.0053 1.0015 0.9996
dispcorr: -0.020064288 hartree
energy: -852.018173240445
dipole: 8.87569 -8.61047 0.26522 13.85401 -13.54713 0.30688 -1.81700 0.90908 -0.90792
magnitude: 0.99440 au
magnitude: 2.52756 debye
