program: Orca
programVersion: 5.0.2
elementType: O O C C C C C C C C C C C C C C C C C C H H H H H H H H H H H H H H H H H H H H H H H H H H
charge: 0
multiplicity: 1
keywords: wb97x-d3
keywords: def2-TZVPP
keywords: def2/J RIJCOSX
keywords: DEFGRID2
keywords: scfconv7
keywords: smallprint printgap noloewdin
keywords: NOSOSCF
formula: C18H26O2
InChI: InChI=1/C18H26O2/c1-8-10-13(5)15(9-2)20-17(19)16-14(11-12(3)4)18(16,6)7/h2,10-11,14-16H,8H2,1,3-7H3
46 atoms
O  -1.024283 -1.09138 -0.364442
O  -0.267351 0.103025 1.372593
C  1.917865 0.873953 -0.765418
C  2.489002 -0.081378 0.237156
C  1.19079 -0.427399 -0.449947
C  1.381666 2.196623 -0.279391
C  2.541692 0.953391 -2.136519
C  3.701107 -0.887204 -0.049665
C  -0.075818 -0.423467 0.300789
C  4.925747 -0.613989 0.409082
C  5.245237 0.563049 1.278855
C  6.096656 -1.483224 0.065619
C  -2.356007 -1.107966 0.188876
C  -3.092126 0.164258 -0.162512
C  -3.004898 -2.286337 -0.377727
C  -3.367022 0.382253 -1.619302
C  -3.440962 0.985305 0.829328
C  -4.183228 2.277166 0.732151
C  -3.571834 -3.244848 -0.825952
C  -5.441162 2.26435 1.596089
H  2.377075 0.243776 1.2674
H  1.244761 -1.173803 -1.235336
H  2.168786 2.950341 -0.343731
H  0.549741 2.539016 -0.898091
H  1.045776 2.170347 0.754787
H  1.832407 1.365458 -2.856554
H  3.414584 1.609274 -2.119716
H  2.864715 -0.018376 -2.508235
H  3.572995 -1.752633 -0.693485
H  5.692221 0.239697 2.222258
H  5.985874 1.203941 0.793706
H  4.378346 1.178991 1.511428
H  6.870491 -0.909333 -0.450583
H  6.563773 -1.886866 0.96763
H  5.814889 -2.320889 -0.571984
H  -2.30677 -1.226521 1.274637
H  -3.661316 1.40646 -1.835817
H  -2.489047 0.161544 -2.228447
H  -4.167918 -0.271281 -1.972852
H  -3.177122 0.692096 1.842893
H  -4.446433 2.513845 -0.298763
H  -3.527647 3.082458 1.077888
H  -4.069388 -4.09819 -1.230257
H  -5.200462 2.072592 2.642742
H  -5.957568 3.223084 1.545501
H  -6.138265 1.492344 1.268496
elementType: O C H
totalener: -851.99900300 hartree
nucrepener: 1532.10067823 hartree
electener: -2384.09968122 hartree
oneelecener: -4197.95124227 hartree
twoeener: 1813.85156105 hartree
cpcmener: -0.02495097 hartree
kineticenergy: 847.98491552 hartree
xcener: -85.216772408793 hartree
chargesum: 0.0000000
charge: -0.288786 -0.492247 0.154717 -0.005830 -0.139926 -0.298567 -0.268482 -0.272124 0.425161 -0.032727 -0.250902 -0.229808 0.163862 -0.148310 -0.533806 -0.267186 -0.088556 -0.075525 0.207015 -0.265632 0.097370 0.094114 0.098453 0.102349 0.092793 0.099408 0.096589 0.091836 0.124601 0.098868 0.097177 0.087522 0.094497 0.094968 0.089802 0.127085 0.103465 0.104140 0.105240 0.117618 0.066505 0.075275 0.286723 0.086690 0.090774 0.083796
qa: -0.2888 -0.4922 0.1547 -0.0058 -0.1399 -0.2986 -0.2685 -0.2721 0.4252 -0.0327 -0.2509 -0.2298 0.1639 -0.1483 -0.5338 -0.2672 -0.0886 -0.0755 0.2070 -0.2656 0.0974 0.0941 0.0985 0.1023 0.0928 0.0994 0.0966 0.0918 0.1246 0.0989 0.0972 0.0875 0.0945 0.0950 0.0898 0.1271 0.1035 0.1041 0.1052 0.1176 0.0665 0.0753 0.2867 0.0867 0.0908 0.0838
va: 2.1184 2.0166 3.6596 3.7879 3.9038 3.9018 3.9048 3.8692 4.1658 3.7030 3.9418 3.9266 3.8368 3.7310 3.9603 3.9331 3.8357 3.9134 3.4139 3.9178 1.0252 1.0382 1.0011 0.9989 1.0173 1.0028 1.0025 1.0024 1.0065 0.9983 0.9971 1.0083 0.9960 0.9954 1.0075 1.0211 1.0076 1.0086 0.9947 1.0150 1.0168 1.0048 0.9450 1.0020 1.0048 1.0031
dispcorr: -0.020206592 hartree
energy: -852.019209588775
dipole: 8.63252 -8.38856 0.24396 13.57298 -13.23301 0.33998 -2.08130 1.18781 -0.89349
magnitude: 0.98662 au
magnitude: 2.50780 debye
