program: Orca
programVersion: 5.0.2
elementType: O O C C C C C C C C C C C C C C C C C C H H H H H H H H H H H H H H H H H H H H H H H H H H
charge: 0
multiplicity: 1
keywords: wb97x-d3
keywords: def2-TZVPP
keywords: def2/J RIJCOSX
keywords: DEFGRID2
keywords: scfconv7
keywords: smallprint printgap noloewdin
keywords: NOSOSCF
formula: C18H26O2
InChI: InChI=1/C18H26O2/c1-8-10-13(5)15(9-2)20-17(19)16-14(11-12(3)4)18(16,6)7/h2,10-11,14-16H,8H2,1,3-7H3
46 atoms
O  -0.790576 -0.91931 -0.293148
O  -0.025219 -0.059948 1.624826
C  1.734838 1.615052 -0.393587
C  2.557224 0.569142 0.274901
C  1.250044 0.169726 -0.389284
C  1.037846 2.652607 0.452183
C  2.153943 2.142533 -1.744306
C  3.843424 0.073607 -0.274414
C  0.115356 -0.255951 0.439566
C  4.44489 -1.054831 0.112571
C  3.873052 -1.982751 1.139993
C  5.762454 -1.474427 -0.462888
C  -1.991099 -1.313842 0.367626
C  -2.960288 -0.163917 0.593288
C  -2.605622 -2.339546 -0.47105
C  -3.943693 -0.445694 1.684697
C  -2.900188 0.939823 -0.149248
C  -3.798296 2.133297 -0.072871
C  -3.142139 -3.182816 -1.136104
C  -4.675334 2.24506 -1.317677
H  2.496359 0.581529 1.359643
H  1.327359 -0.336794 -1.344401
H  0.085949 2.946931 0.004976
H  0.845053 2.320164 1.469713
H  1.660908 3.546552 0.516931
H  2.9005 2.93157 -1.633569
H  2.575764 1.371019 -2.387736
H  1.296528 2.571715 -2.265374
H  4.329762 0.684408 -1.029079
H  2.8509 -1.736231 1.423549
H  3.87975 -3.01227 0.774834
H  4.482605 -1.976001 2.047596
H  6.142858 -0.755433 -1.188276
H  6.513768 -1.592144 0.32221
H  5.679938 -2.445115 -0.958361
H  -1.748976 -1.766889 1.335942
H  -4.71153 0.319158 1.77189
H  -4.45009 -1.399634 1.518914
H  -3.435765 -0.525552 2.649063
H  -2.139543 1.006584 -0.922757
H  -3.179862 3.031863 0.006821
H  -4.426026 2.111913 0.81814
H  -3.624261 -3.916583 -1.743337
H  -5.289669 3.145435 -1.284171
H  -4.072469 2.289093 -2.225887
H  -5.343536 1.38748 -1.404223
elementType: O C H
totalener: -851.99747800 hartree
nucrepener: 1557.81140516 hartree
electener: -2409.80888316 hartree
oneelecener: -4249.27423415 hartree
twoeener: 1839.46535099 hartree
cpcmener: -0.02507559 hartree
kineticenergy: 847.97762322 hartree
xcener: -85.217232594064 hartree
chargesum: 0.0000000
charge: -0.297006 -0.490847 0.161269 -0.050216 -0.067507 -0.271857 -0.294621 -0.282977 0.376043 -0.012251 -0.251302 -0.228226 0.188450 -0.093051 -0.579436 -0.249124 -0.150303 -0.085919 0.237590 -0.266329 0.102882 0.092849 0.097082 0.093701 0.100097 0.102762 0.091145 0.099103 0.127364 0.080603 0.094707 0.103293 0.089066 0.094892 0.095646 0.126038 0.096546 0.101707 0.104445 0.123832 0.073804 0.067763 0.286512 0.091161 0.086163 0.084457
qa: -0.2970 -0.4908 0.1613 -0.0502 -0.0675 -0.2719 -0.2946 -0.2830 0.3760 -0.0123 -0.2513 -0.2282 0.1885 -0.0931 -0.5794 -0.2491 -0.1503 -0.0859 0.2376 -0.2663 0.1029 0.0928 0.0971 0.0937 0.1001 0.1028 0.0911 0.0991 0.1274 0.0806 0.0947 0.1033 0.0891 0.0949 0.0956 0.1260 0.0965 0.1017 0.1044 0.1238 0.0738 0.0678 0.2865 0.0912 0.0862 0.0845
va: 2.1075 2.0042 3.7159 3.8515 3.8018 3.8787 3.9135 3.8796 4.1619 3.7048 3.9446 3.9280 3.8197 3.7337 4.0592 3.9497 3.8372 3.9155 3.3643 3.9084 1.0235 1.0346 1.0004 1.0167 1.0023 0.9984 1.0014 1.0024 1.0028 1.0143 0.9992 0.9974 1.0070 0.9952 0.9962 1.0142 1.0071 0.9966 0.9984 1.0161 1.0067 1.0118 0.9453 1.0053 1.0018 1.0023
dispcorr: -0.020802534 hartree
energy: -852.018280535670
dipole: 4.28317 -4.19763 0.08553 10.17906 -10.03426 0.14480 -2.44528 1.70813 -0.73715
magnitude: 0.75609 au
magnitude: 1.92183 debye
