program: Orca
programVersion: 5.0.2
elementType: O O C C C C C C C C C C C C C C C C C C H H H H H H H H H H H H H H H H H H H H H H H H H H
charge: 0
multiplicity: 1
keywords: wb97x-d3
keywords: def2-TZVPP
keywords: def2/J RIJCOSX
keywords: DEFGRID2
keywords: scfconv7
keywords: smallprint printgap noloewdin
keywords: NOSOSCF
formula: C18H26O2
InChI: InChI=1/C18H26O2/c1-8-10-13(5)15(9-2)20-17(19)16-14(11-12(3)4)18(16,6)7/h2,10-11,14-16H,8H2,1,3-7H3
46 atoms
O  -1.115621 -1.465716 -0.330662
O  -0.696145 0.709248 -0.653672
C  2.096666 -0.47462 -1.548544
C  2.216879 0.135891 -0.18564
C  1.109302 -0.857164 -0.454816
C  1.672754 0.405815 -2.697652
C  3.067422 -1.555851 -1.955037
C  3.301166 -0.236825 0.754003
C  -0.295989 -0.419543 -0.493065
C  4.32335 0.547489 1.108606
C  4.537466 1.934929 0.586363
C  5.363897 0.07186 2.076635
C  -2.534988 -1.239147 -0.28917
C  -2.943181 -0.41367 0.913952
C  -3.021121 -0.769068 -1.582586
C  -2.352006 -0.909222 2.200381
C  -3.782338 0.614634 0.798813
C  -4.287926 1.502528 1.889629
C  -3.436351 -0.437133 -2.659083
C  -3.701678 2.908477 1.768481
H  1.887115 1.169185 -0.137099
H  1.255611 -1.852762 -0.050185
H  2.560328 0.789215 -3.204473
H  1.092883 -0.15496 -3.43317
H  1.084551 1.265582 -2.38527
H  2.656036 -2.150631 -2.772423
H  4.002267 -1.114287 -2.305845
H  3.307491 -2.236772 -1.139308
H  3.253052 -1.236361 1.176788
H  5.50867 2.00678 0.090151
H  3.779882 2.254925 -0.126426
H  4.557567 2.659552 1.404205
H  5.165627 -0.939356 2.431123
H  6.356893 0.08193 1.620001
H  5.419066 0.730769 2.946951
H  -2.928749 -2.249815 -0.140477
H  -2.9005 -0.550902 3.068339
H  -2.3507 -2.000034 2.240795
H  -1.315347 -0.585165 2.320903
H  -4.127849 0.88525 -0.195115
H  -4.065985 1.099166 2.877921
H  -5.377014 1.567034 1.816529
H  -3.808074 -0.120585 -3.608469
H  -4.106148 3.56868 2.536276
H  -2.61672 2.892246 1.8775
H  -3.930375 3.351053 0.797822
elementType: O C H
totalener: -851.99645478 hartree
nucrepener: 1553.45395472 hartree
electener: -2405.45040950 hartree
oneelecener: -4241.11454130 hartree
twoeener: 1835.66413180 hartree
cpcmener: -0.02882886 hartree
kineticenergy: 847.97840562 hartree
xcener: -85.218533470732 hartree
chargesum: -0.0000000
charge: -0.295895 -0.488542 0.154250 0.008620 -0.142139 -0.294963 -0.265537 -0.282519 0.425749 -0.030962 -0.253278 -0.228676 0.264960 -0.152792 -0.568950 -0.284363 -0.116117 -0.079611 0.175655 -0.267134 0.097524 0.091516 0.097594 0.101662 0.092416 0.099016 0.096796 0.090450 0.124126 0.096661 0.089102 0.097689 0.090121 0.094530 0.095091 0.131389 0.105675 0.107280 0.105683 0.124283 0.067650 0.074746 0.287258 0.092685 0.084569 0.086733
qa: -0.2959 -0.4885 0.1542 0.0086 -0.1421 -0.2950 -0.2655 -0.2825 0.4257 -0.0310 -0.2533 -0.2287 0.2650 -0.1528 -0.5689 -0.2844 -0.1161 -0.0796 0.1757 -0.2671 0.0975 0.0915 0.0976 0.1017 0.0924 0.0990 0.0968 0.0904 0.1241 0.0967 0.0891 0.0977 0.0901 0.0945 0.0951 0.1314 0.1057 0.1073 0.1057 0.1243 0.0676 0.0747 0.2873 0.0927 0.0846 0.0867
va: 2.1203 2.0151 3.6665 3.7707 3.9131 3.9073 3.9047 3.8753 4.1257 3.7084 3.9449 3.9245 3.8880 3.7923 4.0124 3.9583 3.7868 3.9211 3.4934 3.9052 1.0258 1.0402 1.0007 0.9991 1.0178 1.0024 1.0028 1.0032 1.0071 0.9971 1.0083 0.9978 1.0079 0.9961 0.9954 0.9809 1.0053 1.0006 0.9963 1.0100 1.0158 1.0030 0.9466 1.0048 1.0041 1.0019
dispcorr: -0.020486323 hartree
energy: -852.016941107017
dipole: 13.31129 -12.74384 0.56746 7.94700 -8.61638 -0.66938 7.67898 -7.26145 0.41753
magnitude: 0.97181 au
magnitude: 2.47014 debye
