program: Gaussian 09
title: 000007748
version: EM64L-G09RevD.01
frameworkgroup: C1[X(C4H7BrO2)]
method: RPBEPBE
basis: SDD
operation: Freq
keyword: #p
keyword: freq=noraman
keyword: PBEPBE/SDD
title: #p freq=noraman PBEPBE/SDD
converged: YES YES NO NO
title: Mulliken charges:
elementType: Br O O C C C C H H H H H H H
charge: 0.032012 -0.270357 -0.206682 -0.222108 -0.669515 0.349911 -0.771057 0.234144 0.234498 0.215675 0.231607 0.231424 0.305109 0.305338
chargesum: 0.00000
title: Mulliken charges with hydrogens summed into heavy atoms:
elementType: Br O O C C C C
charge: 0.032012 -0.270357 -0.206682 0.246535 0.009190 0.349911 -0.160610
polarizability: 9.47017309e+01 7.98455307e+00 5.48153436e+01 -3.07541012e-01 -2.60860521e-01 3.90508890e+01
1716.lowfreq: -27.9133 -5.0597 -0.0006 -0.0004 0.0003 5.6935 17.2449 59.3769 112.7575
frequency: -27.5231 58.3571 112.7545 126.9744 191.8155 244.6173 299.4898 373.3401 535.3953 645.0346 665.7236 800.4308 811.1246 878.2161 913.3667 1022.4657 1101.6731 1117.4310 1134.5689 1137.8970 1249.9487 1256.5210 1358.0554 1402.6191 1416.6084 1463.7727 1474.6012 1486.3366 1667.9896 2998.1267 3013.4318 3059.0257 3073.1251 3094.3945 3111.3627 3135.5562
redmass: 3.5691 2.9242 4.8871 2.0311 8.0914 1.2375 6.6683 3.5513 2.7776 7.0354 5.3409 1.0969 3.9138 1.7497 5.6521 2.3422 3.0948 2.3533 1.3826 1.1959 1.1374 1.4997 1.3516 1.2595 1.0953 1.0397 1.0598 1.0713 10.6021 1.0360 1.0584 1.0570 1.1069 1.0983 1.1028 1.1071
irintensity: 1.4532 0.2546 1.3237 10.3223 1.1512 1.4707 10.9250 4.7066 1.4209 5.9468 25.8531 4.8764 9.3652 13.6616 34.0370 69.2937 312.2260 122.0641 7.3307 3.0753 0.0135 29.2603 1.6448 22.7139 33.5684 12.6966 5.2356 14.1002 153.4157 18.5127 16.8952 8.5817 7.3383 26.7138 42.9650 0.3516
temp: 298.150 k
press: 1.00000 atm
elementType: 35 8 8 6 6 6 6 1 1 1 1 1 1 1
symmnumber: 1
zpe: 277725.9 jmol-1
zpe.correction: 0.105780 hartree
zpe.thermalcorrener: 0.113571 hartree
zpe.thermalcorrenthalpy: 0.114515 hartree
zpe.thermalcorrgfe: 0.071641 hartree
zpe.sumelectzpe: -319.962918 hartree
zpe.sumelectthermal: -319.955127 hartree
zpe.sumelectthermalent: -319.954183 hartree
zpe.sumelectthermalfe: -319.997057 hartree
dipole: -3.3109 -2.1102 0.0481
dipole: 3.9265
quadrupole: -43.4426 -54.4381 -49.8450
quadrupole: -2.0235 0.0463 -0.1287
quadrupole: 5.7993 -5.1962 -0.6031 -2.0235 0.0463 -0.1287
hfenergy: -320.068698 hartree
pointgroup: C01 [X(C4H7Br1O2)]
dipole: -1.3313106 -0.7832011 0.0238491 debye
dipolederiv: -0.3674436 -0.0165521 0.0048234 -0.0684598 -0.0809053 0.001828 0.0093306 0.0002342 -0.0920558 -1.8524363 -0.1477203 -0.0064554 -0.0302237 -0.5342417 -0.0034552 -0.0091372 -0.0016091 -0.2821655 -0.6547897 0.0459118 -0.0021626 -0.2462089 -0.8685843 -0.0039535 -0.0054396 0.0005282 -0.2873598 0.9245764 -0.0493577 0.0017781 -0.2743118 0.2622372 -0.000131 -0.0017922 0.0001395 0.3557339 -0.1469349 -0.0585751 -0.0011011 -0.0303579 0.0203355 -0.0008799 -0.0012797 -0.0007077 0.0605996 1.7071933 0.1023626 0.0127127 0.1327628 1.1655211 0.0083907 0.0295578 -0.0024589 0.1955195 0.4765485 0.2013278 -0.0181793 0.4651882 -0.1352698 -0.0019576 -0.0327581 0.0043778 0.0828429 -0.0428547 -0.0256786 -0.0398329 0.0667535 -0.0002761 -0.0835836 -0.0034119 -0.1021647 -0.0571669 -0.0450575 -0.0271084 0.0400221 0.0666413 -0.001133 0.0839425 0.0043505 0.1016626 -0.0546849 -0.1076929 0.0892127 -0.0008898 0.1082789 0.0111375 0.0004331 -0.0010059 0.0002751 0.1186567 0.107584 0.00224 0.0188674 -0.0523766 0.0150136 -0.1064831 -0.0102388 -0.116405 -0.0616406 0.1076892 0.0008922 -0.0169862 -0.0538594 0.0135907 0.1064635 0.0119199 0.1170222 -0.0605441 -0.0540064 -0.0629003 -0.0476428 -0.0446559 0.0616415 -0.0632138 -0.0071736 -0.069622 0.0473384 -0.0523753 -0.0540546 0.0550463 -0.0391708 0.0709331 0.0625998 0.017078 0.0687278 0.0349265 unknown
polarizability: 95.2167759|6.5405289|54.2970647|-0.5572691|-0.2596135|39.0541229 unknown
InChI: InChI=1S/C4H7BrO2/c1-2-7-4(6)3-5/h2-3H2,1H3
charge 0 multiplicity 1
14 atoms
Br 3.399836 -0.214016 -0.036196
O  -0.76915 -0.450123 -0.001173
O  0.643256 1.41157 0.009555
C  -1.96274 0.458858 -0.005857
C  -3.196549 -0.436021 -0.016417
C  0.478998 0.177747 0.009295
C  1.535579 -0.924295 0.02527
H  -1.907443 1.101005 0.89165
H  -1.895962 1.106388 -0.898629
H  -4.107889 0.189409 -0.020189
H  -3.212418 -1.07713 -0.914016
H  -3.223739 -1.082802 0.876836
H  1.409913 -1.583627 -0.846643
H  1.447408 -1.519564 0.946913
