program: Orca
programVersion: 5.0.2
elementType: O O C C C C C C C C C C C C C C C C C C H H H H H H H H H H H H H H H H H H H H H H H H H H
charge: 0
multiplicity: 1
keywords: wb97x-d3
keywords: def2-TZVPP
keywords: def2/J RIJCOSX
keywords: DEFGRID2
keywords: scfconv7
keywords: smallprint printgap noloewdin
keywords: NOSOSCF
formula: C18H26O2
InChI: InChI=1/C18H26O2/c1-8-10-13(5)15(9-2)20-17(19)16-14(11-12(3)4)18(16,6)7/h2,10-11,14-16H,8H2,1,3-7H3
46 atoms
O  -0.687528 -1.017757 0.34603
O  -0.459963 0.091693 2.272937
C  2.225235 -1.92252 0.758246
C  2.136845 -0.787527 -0.19983
C  1.487716 -0.65776 1.17418
C  1.48269 -3.201441 0.456257
C  3.519324 -2.161474 1.499624
C  3.28407 0.080915 -0.55933
C  0.035437 -0.494535 1.335229
C  3.154761 1.288674 -1.116065
C  1.823924 1.918637 -1.398584
C  4.347964 2.099759 -1.516003
C  -2.094542 -0.712169 0.29369
C  -2.299573 0.622204 -0.384929
C  -2.711598 -1.808577 -0.445616
C  -1.885171 0.696471 -1.824182
C  -2.818613 1.621609 0.330576
C  -3.12404 3.010751 -0.12573
C  -3.25777 -2.686614 -1.056132
C  -4.597477 3.35267 0.079172
H  1.419477 -0.938187 -1.001532
H  2.02905 -0.049891 1.890095
H  2.152458 -3.894916 -0.055474
H  1.148794 -3.688996 1.373674
H  0.617588 -3.059043 -0.186207
H  4.022217 -1.236013 1.779028
H  3.333798 -2.724665 2.415707
H  4.209416 -2.74528 0.887455
H  4.282651 -0.307456 -0.381849
H  1.599311 1.893259 -2.468298
H  1.000087 1.434635 -0.876294
H  1.827511 2.971723 -1.110115
H  4.360887 3.060248 -0.994779
H  5.285319 1.585796 -1.304124
H  4.323263 2.330282 -2.584245
H  -2.514339 -0.69346 1.302605
H  -0.943921 0.173477 -1.99961
H  -2.629253 0.230348 -2.474112
H  -1.749884 1.720731 -2.163341
H  -3.07808 1.419198 1.367174
H  -2.854105 3.158955 -1.171357
H  -2.516138 3.711386 0.454944
H  -3.739502 -3.468708 -1.600723
H  -4.884331 3.257548 1.127391
H  -4.803958 4.378069 -0.227887
H  -5.242802 2.693658 -0.502654
elementType: O C H
totalener: -851.99573202 hartree
nucrepener: 1583.83966336 hartree
electener: -2435.83539538 hartree
oneelecener: -4301.07478730 hartree
twoeener: 1865.23939192 hartree
cpcmener: -0.02549930 hartree
kineticenergy: 847.98908085 hartree
xcener: -85.218687860497 hartree
chargesum: -0.0000000
charge: -0.278011 -0.496302 0.150469 -0.007946 -0.107016 -0.268156 -0.296546 -0.311095 0.419256 -0.001469 -0.234950 -0.228679 0.143083 -0.130500 -0.536042 -0.302562 -0.082517 -0.074879 0.202165 -0.266347 0.108794 0.089882 0.094664 0.101132 0.088244 0.091877 0.099359 0.101111 0.127287 0.107746 0.054814 0.097230 0.095748 0.089149 0.095781 0.122927 0.102913 0.116671 0.112702 0.119352 0.065807 0.075381 0.287300 0.086771 0.091158 0.084244
qa: -0.2780 -0.4963 0.1505 -0.0079 -0.1070 -0.2682 -0.2965 -0.3111 0.4193 -0.0015 -0.2349 -0.2287 0.1431 -0.1305 -0.5360 -0.3026 -0.0825 -0.0749 0.2022 -0.2663 0.1088 0.0899 0.0947 0.1011 0.0882 0.0919 0.0994 0.1011 0.1273 0.1077 0.0548 0.0972 0.0957 0.0891 0.0958 0.1229 0.1029 0.1167 0.1127 0.1194 0.0658 0.0754 0.2873 0.0868 0.0912 0.0842
va: 2.1107 2.0048 3.7330 3.7861 3.8345 3.8892 3.9189 3.8671 4.1422 3.7050 3.9441 3.9294 3.8954 3.6858 3.9236 3.9467 3.8351 3.9132 3.4154 3.9192 1.0155 1.0297 1.0010 0.9999 1.0103 1.0014 1.0021 0.9987 1.0041 0.9960 1.0121 1.0029 0.9965 1.0070 0.9946 1.0247 0.9997 0.9969 1.0031 1.0141 1.0164 1.0052 0.9448 1.0022 1.0047 1.0029
dispcorr: -0.022391945 hartree
energy: -852.018123968516
dipole: 6.50582 -6.15000 0.35583 10.54157 -10.49374 0.04783 -8.02060 6.66492 -1.35568
magnitude: 1.40242 au
magnitude: 3.56466 debye
