program: Orca
programVersion: 5.0.2
elementType: O O C C C C C C C C C C C C C C C C C C H H H H H H H H H H H H H H H H H H H H H H H H H H
charge: 0
multiplicity: 1
keywords: wb97x-d3
keywords: def2-TZVPP
keywords: def2/J RIJCOSX
keywords: DEFGRID2
keywords: scfconv7
keywords: smallprint printgap noloewdin
keywords: NOSOSCF
formula: C18H26O2
InChI: InChI=1/C18H26O2/c1-8-10-13(5)15(9-2)20-17(19)16-14(11-12(3)4)18(16,6)7/h2,10-11,14-16H,8H2,1,3-7H3
46 atoms
O  -0.947734 -0.949888 -0.400626
O  -0.227623 0.394401 1.237516
C  1.950348 1.169958 -0.879546
C  2.529837 0.1623 0.065492
C  1.201789 -0.12511 -0.612369
C  1.455743 2.479169 -0.315487
C  2.535333 1.314094 -2.264305
C  3.697492 -0.675309 -0.275836
C  -0.034186 -0.171433 0.188779
C  4.785554 -0.869135 0.47701
C  5.018536 -0.244022 1.81853
C  5.891394 -1.767132 0.008045
C  -2.235787 -1.080072 0.230215
C  -3.150341 0.042562 -0.192022
C  -2.749396 -2.381917 -0.186582
C  -3.522975 0.099569 -1.643672
C  -3.584686 0.903034 0.728741
C  -4.509789 2.057897 0.482238
C  -3.201889 -3.440145 -0.527699
C  -5.191525 2.541577 1.754713
H  2.437296 0.438324 1.110584
H  1.232055 -0.840288 -1.427181
H  2.253074 3.223034 -0.374107
H  0.609397 2.862083 -0.889924
H  1.152642 2.413426 0.726768
H  3.425463 1.946254 -2.238435
H  2.819476 0.361829 -2.710583
H  1.814714 1.786853 -2.934659
H  3.650981 -1.18787 -1.232458
H  5.990388 0.255458 1.843349
H  4.266022 0.490208 2.099619
H  5.046523 -1.007588 2.600912
H  6.080139 -2.567467 0.728726
H  5.670234 -2.228437 -0.95462
H  6.830275 -1.215539 -0.091378
H  -2.121366 -1.080448 1.317796
H  -3.769182 1.112211 -1.959655
H  -2.710854 -0.249705 -2.282841
H  -4.38938 -0.531021 -1.859267
H  -3.245091 0.771925 1.753425
H  -5.265676 1.786451 -0.258473
H  -3.945231 2.886841 0.041256
H  -3.600333 -4.383277 -0.829136
H  -5.858821 3.378599 1.547493
H  -5.786748 1.750842 2.214377
H  -4.461388 2.877639 2.492967
elementType: O C H
totalener: -852.01191284 hartree
nucrepener: 1524.58515392 hartree
electener: -2376.59706676 hartree
oneelecener: -4182.80560097 hartree
twoeener: 1806.20853422 hartree
cpcmener: -0.02100096 hartree
kineticenergy: 847.96490510 hartree
xcener: -85.211347055848 hartree
chargesum: -0.0000000
charge: -0.286819 -0.468335 0.110802 0.045545 -0.119905 -0.281794 -0.268056 -0.277990 0.405090 -0.041665 -0.255540 -0.219713 0.162424 -0.124486 -0.513381 -0.290030 -0.091667 -0.078999 0.193993 -0.271293 0.091641 0.088143 0.095848 0.098553 0.094224 0.096870 0.087982 0.097577 0.115875 0.093246 0.090530 0.098305 0.092636 0.088093 0.093598 0.122803 0.103829 0.104189 0.110160 0.108909 0.075646 0.080773 0.282797 0.089676 0.086586 0.083333
qa: -0.2868 -0.4683 0.1108 0.0455 -0.1199 -0.2818 -0.2681 -0.2780 0.4051 -0.0417 -0.2555 -0.2197 0.1624 -0.1245 -0.5134 -0.2900 -0.0917 -0.0790 0.1940 -0.2713 0.0916 0.0881 0.0958 0.0986 0.0942 0.0969 0.0880 0.0976 0.1159 0.0932 0.0905 0.0983 0.0926 0.0881 0.0936 0.1228 0.1038 0.1042 0.1102 0.1089 0.0756 0.0808 0.2828 0.0897 0.0866 0.0833
va: 2.1149 2.0440 3.6844 3.7700 3.8656 3.9041 3.9095 3.8812 4.1789 3.7528 3.9434 3.9225 3.8657 3.6693 3.9468 3.9451 3.8426 3.8991 3.4218 3.9513 1.0322 1.0385 1.0003 0.9992 1.0192 1.0021 1.0060 1.0021 1.0116 0.9977 1.0092 0.9962 0.9957 1.0092 0.9962 1.0247 1.0006 1.0134 0.9924 1.0143 1.0004 1.0009 0.9474 1.0054 1.0001 0.9986
dispcorr: -0.019350647 hartree
energy: -852.031263482370
dipole: 7.60313 -7.45544 0.14769 11.83851 -11.72133 0.11719 -1.28485 0.50336 -0.78149
magnitude: 0.80391 au
magnitude: 2.04338 debye
