program: Orca
programVersion: 5.0.2
elementType: O O C C C C C C C C C C C C C C C C C C H H H H H H H H H H H H H H H H H H H H H H H H H H
charge: 0
multiplicity: 1
keywords: wb97x-d3
keywords: def2-TZVPP
keywords: def2/J RIJCOSX
keywords: DEFGRID2
keywords: scfconv7
keywords: smallprint printgap noloewdin
keywords: NOSOSCF
formula: C18H26O2
InChI: InChI=1/C18H26O2/c1-8-10-13(5)15(9-2)20-17(19)16-14(11-12(3)4)18(16,6)7/h2,10-11,14-16H,8H2,1,3-7H3
46 atoms
O  -0.857691 -0.950409 -0.356959
O  -0.036153 -0.162574 1.567629
C  1.692846 1.538828 -0.46732
C  2.516668 0.489395 0.199791
C  1.20674 0.095074 -0.462365
C  1.007079 2.576976 0.386492
C  2.106116 2.072341 -1.818012
C  3.804802 -0.000783 -0.341789
C  0.076001 -0.330699 0.377759
C  4.535134 -0.982001 0.196442
C  4.127051 -1.748002 1.418304
C  5.852289 -1.382669 -0.394638
C  -2.051306 -1.343814 0.313476
C  -2.998402 -0.185792 0.588699
C  -2.695086 -2.340255 -0.539236
C  -3.983551 -0.493505 1.671835
C  -2.909714 0.951559 -0.097816
C  -3.75497 2.175913 0.050807
C  -3.256539 -3.156469 -1.217206
C  -4.502658 2.50274 -1.238922
H  2.453293 0.504878 1.283594
H  1.275552 -0.410454 -1.419036
H  0.071542 2.90541 -0.071234
H  0.785171 2.230339 1.393541
H  1.649485 3.454859 0.480496
H  2.86143 2.853703 -1.710104
H  2.512877 1.303456 -2.474265
H  1.24818 2.513429 -2.328947
H  4.185384 0.486931 -1.234021
H  3.083462 -1.602843 1.692011
H  4.282805 -2.81871 1.270515
H  4.73859 -1.465304 2.279286
H  5.837022 -2.428375 -0.713824
H  6.122124 -0.77197 -1.256418
H  6.656171 -1.298306 0.341886
H  -1.79946 -1.824168 1.266565
H  -4.481329 -1.449539 1.492528
H  -3.479319 -0.580081 2.637881
H  -4.759582 0.262129 1.767888
H  -2.149034 1.032908 -0.870064
H  -3.103539 3.018672 0.303247
H  -4.464061 2.082898 0.873875
H  -3.750955 -3.883704 -1.821655
H  -5.197403 1.705339 -1.506057
H  -5.076557 3.424527 -1.135823
H  -3.814248 2.635392 -2.075426
elementType: O C H
totalener: -852.01048810 hartree
nucrepener: 1554.17505500 hartree
electener: -2406.18554310 hartree
oneelecener: -4241.86612587 hartree
twoeener: 1835.68058277 hartree
cpcmener: -0.02121747 hartree
kineticenergy: 847.97021628 hartree
xcener: -85.215046035267 hartree
chargesum: 0.0000000
charge: -0.291988 -0.460730 0.147793 -0.055494 -0.048018 -0.268611 -0.295948 -0.261447 0.351234 -0.016106 -0.260471 -0.228672 0.178977 -0.084268 -0.567751 -0.252592 -0.150287 -0.081281 0.236444 -0.262790 0.101241 0.092534 0.092921 0.095698 0.099598 0.104026 0.088112 0.098850 0.121365 0.084194 0.093238 0.102105 0.094058 0.087378 0.093537 0.123513 0.101074 0.104710 0.095516 0.117692 0.072592 0.067353 0.282354 0.083904 0.089807 0.084634
qa: -0.2920 -0.4607 0.1478 -0.0555 -0.0480 -0.2686 -0.2959 -0.2614 0.3512 -0.0161 -0.2605 -0.2287 0.1790 -0.0843 -0.5678 -0.2526 -0.1503 -0.0813 0.2364 -0.2628 0.1012 0.0925 0.0929 0.0957 0.0996 0.1040 0.0881 0.0988 0.1214 0.0842 0.0932 0.1021 0.0941 0.0874 0.0935 0.1235 0.1011 0.1047 0.0955 0.1177 0.0726 0.0674 0.2824 0.0839 0.0898 0.0846
va: 2.1121 2.0392 3.7547 3.8475 3.7936 3.8786 3.9145 3.8914 4.2052 3.7117 3.9458 3.9306 3.8357 3.7472 4.0550 3.9487 3.8443 3.9113 3.3700 3.9110 1.0224 1.0339 1.0016 1.0171 1.0023 0.9986 1.0026 1.0023 1.0061 1.0136 0.9991 0.9963 0.9965 1.0080 0.9948 1.0142 0.9976 0.9975 1.0076 1.0179 1.0061 1.0142 0.9481 1.0033 1.0052 1.0026
dispcorr: -0.020588844 hartree
energy: -852.031076948136
dipole: 5.25947 -5.18321 0.07626 11.18018 -10.97561 0.20457 -1.53870 0.93331 -0.60539
magnitude: 0.64355 au
magnitude: 1.63578 debye
