program: Orca
programVersion: 5.0.2
elementType: O O C C C C C C C C C C C C C C C C C C H H H H H H H H H H H H H H H H H H H H H H H H H H
charge: 0
multiplicity: 1
keywords: wb97x-d3
keywords: def2-TZVPP
keywords: def2/J RIJCOSX
keywords: DEFGRID2
keywords: scfconv7
keywords: smallprint printgap noloewdin
keywords: NOSOSCF
formula: C18H26O2
InChI: InChI=1/C18H26O2/c1-8-10-13(5)15(9-2)20-17(19)16-14(11-12(3)4)18(16,6)7/h2,10-11,14-16H,8H2,1,3-7H3
46 atoms
O  -0.696326 -0.667861 0.439508
O  -0.796795 0.882467 2.045365
C  2.162116 -1.152686 1.517354
C  2.172683 -0.408441 0.215442
C  1.327189 0.107232 1.367801
C  1.511026 -2.513973 1.567761
C  3.346769 -1.042588 2.447671
C  3.317756 0.404476 -0.239063
C  -0.146612 0.154168 1.333356
C  3.825609 0.445422 -1.475483
C  3.322356 -0.356818 -2.636577
C  4.981811 1.344125 -1.798897
C  -2.126093 -0.637146 0.28531
C  -2.533076 0.484644 -0.643839
C  -2.500126 -1.948525 -0.236718
C  -1.928481 0.451598 -2.013435
C  -3.379203 1.407403 -0.183248
C  -3.936651 2.585199 -0.913591
C  -2.854949 -3.017364 -0.652909
C  -5.434201 2.434514 -1.168214
H  1.608488 -0.89688 -0.570387
H  1.729046 0.964854 1.896842
H  2.271042 -3.285566 1.428292
H  1.044215 -2.690106 2.539376
H  0.756054 -2.664607 0.79949
H  3.060781 -1.319011 3.464507
H  4.14308 -1.720493 2.132826
H  3.765477 -0.037898 2.489918
H  3.776196 1.042064 0.511534
H  2.951763 0.300611 -3.427911
H  4.134944 -0.939891 -3.078038
H  2.523284 -1.050611 -2.382454
H  4.721682 2.045943 -2.596158
H  5.309263 1.924461 -0.936055
H  5.838158 0.769654 -2.162696
H  -2.604545 -0.506336 1.260026
H  -2.326973 1.229412 -2.660673
H  -0.844722 0.582937 -1.978535
H  -2.114728 -0.506414 -2.504595
H  -3.73644 1.297505 0.838126
H  -3.418991 2.756741 -1.857771
H  -3.769269 3.479271 -0.305641
H  -3.171896 -3.96303 -1.032599
H  -5.836251 3.321094 -1.660428
H  -5.640704 1.574977 -1.807279
H  -5.985921 2.295792 -0.236876
elementType: O C H
totalener: -852.01066879 hartree
nucrepener: 1552.69462219 hartree
electener: -2404.70529098 hartree
oneelecener: -4238.75674206 hartree
twoeener: 1834.05145109 hartree
cpcmener: -0.02228013 hartree
kineticenergy: 847.96952146 hartree
xcener: -85.214056630137 hartree
chargesum: -0.0000000
charge: -0.281723 -0.462347 0.092304 0.071650 -0.108671 -0.267225 -0.274051 -0.289742 0.405707 -0.046449 -0.257803 -0.220226 0.142187 -0.144091 -0.536571 -0.259082 -0.072179 -0.088418 0.205664 -0.265247 0.094000 0.087477 0.093972 0.099738 0.087822 0.097442 0.096700 0.087584 0.116992 0.097034 0.096283 0.089911 0.092212 0.088159 0.093540 0.123524 0.101678 0.100140 0.102176 0.120698 0.068732 0.075639 0.282738 0.091256 0.085357 0.085507
qa: -0.2817 -0.4623 0.0923 0.0717 -0.1087 -0.2672 -0.2741 -0.2897 0.4057 -0.0464 -0.2578 -0.2202 0.1422 -0.1441 -0.5366 -0.2591 -0.0722 -0.0884 0.2057 -0.2652 0.0940 0.0875 0.0940 0.0997 0.0878 0.0974 0.0967 0.0876 0.1170 0.0970 0.0963 0.0899 0.0922 0.0882 0.0935 0.1235 0.1017 0.1001 0.1022 0.1207 0.0687 0.0756 0.2827 0.0913 0.0854 0.0855
va: 2.1153 2.0507 3.7167 3.7252 3.8516 3.9115 3.9176 3.8675 4.1873 3.7664 3.9425 3.9227 3.8928 3.7577 3.9463 3.9527 3.8114 3.9209 3.4194 3.9143 1.0232 1.0336 1.0005 0.9999 1.0101 1.0014 1.0015 1.0069 1.0118 0.9963 0.9978 1.0102 0.9962 1.0089 0.9963 1.0238 1.0077 0.9986 0.9978 1.0096 1.0120 1.0045 0.9482 1.0048 1.0023 1.0023
dispcorr: -0.020482933 hartree
energy: -852.031151718586
dipole: 7.84127 -7.35679 0.48449 4.44084 -4.92053 -0.47969 -10.09499 9.02728 -1.06771
magnitude: 1.26682 au
magnitude: 3.22001 debye
