program: Gaussian 09
title: 000067385
version: EM64L-G09RevD.01
frameworkgroup: C1[X(C19H25IO3)]
method: RPBEPBE
basis: SDD
operation: Freq
keyword: #p
keyword: freq=noraman
keyword: PBEPBE/SDD
title: #p freq=noraman PBEPBE/SDD
converged: YES YES NO NO
title: Mulliken charges:
elementType: I O O O C C C C C C C C C C C C C C C C C C C H H H H H H H H H H H H H H H H H H H H H H H H H
charge: 0.033891 -0.286622 -0.419074 -0.438327 0.392903 -0.111082 -0.108598 -0.234669 -0.584369 -0.160056 -0.533179 -0.044709 -0.645968 -0.507620 -0.851996 0.300005 -0.592883 0.320697 -0.337660 -0.593755 -0.507667 -0.416698 0.293883 0.228816 0.264293 0.213983 0.214242 0.229862 0.283379 0.242561 0.262354 0.179084 0.297564 0.219532 0.218831 0.289135 0.213883 0.213028 0.224668 0.224605 0.336989 0.211578 0.223049 0.202238 0.203608 0.236452 0.248523 0.351296
chargesum: 0.00000
title: Mulliken charges with hydrogens summed into heavy atoms:
elementType: I O O O C C C C C C C C C C C C C C C C C C C
charge: 0.033891 -0.286622 -0.082085 -0.087031 0.392903 0.117734 0.155695 -0.020686 -0.140265 0.123323 -0.028264 0.134375 -0.348404 -0.069256 -0.135950 0.300005 -0.143609 0.320697 -0.126082 -0.370706 0.134630 -0.168175 0.293883
polarizability: 3.10070692e+02 -6.23728660e+00 2.17077959e+02 -5.32479747e+00 -1.16708331e+01 1.67500242e+02
1716.lowfreq: -10.3595 -3.8634 0.0002 0.0003 0.0007 3.6385 15.7704 34.6888 39.6644
frequency: 14.6376 34.6816 39.6177 52.5002 65.2082 93.7747 126.7856 136.5822 149.5044 156.6687 184.1070 206.2832 210.7282 234.4859 236.1862 244.0970 271.8365 287.2649 303.6309 310.7388 325.2411 333.0181 352.6587 360.3852 363.4251 392.5297 405.1940 439.8055 445.3783 457.8581 484.3488 510.1435 524.1968 552.8830 561.6100 577.9430 607.9325 632.1723 652.4283 694.4694 720.6587 731.9400 746.1891 790.0951 810.1974 829.1610 841.1006 856.6441 863.0371 896.2342 906.8380 919.7502 924.3349 948.4882 965.0942 972.7178 989.0226 1004.1371 1014.2538 1026.5447 1036.7777 1042.3003 1052.0000 1077.1438 1092.9146 1103.7117 1111.6358 1120.8815 1128.4825 1132.3876 1137.1151 1142.6699 1149.9449 1168.3050 1173.6845 1180.9983 1193.4732 1201.2129 1209.3847 1217.6504 1237.6753 1257.3882 1261.8885 1262.5794 1275.8915 1281.1808 1290.9562 1292.5129 1298.4954 1307.7448 1322.8605 1334.1459 1341.5064 1342.6369 1353.4668 1362.2483 1373.0403 1384.8591 1389.8819 1395.9127 1428.6038 1433.8811 1449.4874 1456.1480 1456.8935 1462.9401 1471.8696 1473.7755 1474.9533 1503.0358 1506.8212 1603.5003 1621.6750 2904.9252 2908.9580 2923.1147 2929.0198 2956.8950 2967.0086 2970.1573 2973.1286 2988.2923 2991.8502 3003.2358 3018.7094 3031.6584 3036.0657 3050.9337 3052.5601 3064.9397 3087.2001 3093.3530 3099.4149 3101.2272 3134.2581 3170.1128 3551.5540 3580.3006
redmass: 7.6778 4.9876 2.8751 3.3089 4.8693 4.8131 2.2727 3.8696 3.7876 4.4026 2.8306 3.3387 2.2228 2.8173 2.7149 1.4877 2.9565 3.4205 3.4028 4.1558 2.1381 1.5298 1.1315 3.0457 2.4847 2.9834 2.9934 2.7410 3.5433 3.9617 2.8989 4.4421 3.4119 3.9223 3.4818 4.0047 3.6176 4.2929 2.9225 3.4730 5.4547 3.4576 3.3285 2.8571 2.1837 1.6935 2.0711 2.2563 1.8978 2.5707 2.6946 2.5017 2.1225 1.3967 2.5083 2.1392 2.5570 2.8230 2.8549 2.8422 3.2702 2.5941 2.8279 2.2316 1.8777 1.6683 1.2775 1.5764 1.7616 1.4881 1.5521 1.3881 1.3975 1.7419 1.7378 1.5207 1.5655 1.5809 1.5320 1.5242 1.3694 1.8021 1.5921 1.6351 1.4766 1.5014 1.5725 1.6651 1.5129 1.4188 1.4110 1.4172 1.5014 1.3782 1.3581 1.5306 1.3186 4.1576 1.2068 1.3956 3.3924 1.1418 1.0743 1.0736 1.1136 1.0700 1.0910 1.0578 1.0619 2.7787 1.0531 6.6641 6.6878 1.0809 1.0790 1.0721 1.0431 1.0646 1.0636 1.0510 1.0516 1.0792 1.0702 1.1025 1.0942 1.0980 1.1012 1.0960 1.0881 1.0871 1.0958 1.0907 1.0973 1.0966 1.0875 1.0956 1.0654 1.0660
irintensity: 0.3491 0.5311 2.6307 1.5885 1.1842 0.2816 2.7297 0.1727 0.9932 0.1259 0.9462 8.1321 1.4423 3.1844 1.5116 0.7792 0.9903 30.1263 3.3995 1.9529 29.1524 88.7539 137.0096 24.9891 2.3336 5.4253 10.5503 12.0248 3.8548 18.2899 8.5151 1.0884 3.2431 3.7420 1.8856 22.3498 4.4967 8.1521 17.9992 5.1604 2.7344 2.8479 3.4219 12.8877 5.6822 1.0055 15.2451 15.6117 27.2866 13.7140 3.4150 21.2454 12.1563 1.8713 5.0237 19.8749 13.1763 34.2855 75.0665 6.1943 46.4067 35.2559 24.5730 11.0380 17.8573 4.4279 1.3911 0.2740 44.7936 38.9911 216.3348 7.0741 10.0894 2.9588 19.7218 4.3247 40.7959 7.0701 27.1532 8.8137 1.6001 18.0114 19.2283 1.0989 8.9594 1.3585 1.7023 8.3584 2.1443 0.9441 2.3261 0.3984 2.2670 8.8496 12.7219 2.9162 17.9156 13.2118 26.7092 4.7423 38.7191 4.9791 4.2561 8.2900 16.1784 18.1735 5.3486 6.4389 5.7872 83.7840 12.2905 9.8621 67.4048 15.6028 21.5403 39.6001 89.5151 27.6455 22.3733 52.4573 23.5327 11.7116 32.5128 67.1572 38.2909 26.0413 55.2811 39.6443 6.3040 19.1954 11.0601 25.8119 24.0407 3.7974 16.1704 10.9528 7.4204 37.0529
temp: 298.150 k
press: 1.00000 atm
elementType: 53 8 8 8 6 6 6 6 6 6 6 6 6 6 6 6 6 6 6 6 6 6 6 1 1 1 1 1 1 1 1 1 1 1 1 1 1 1 1 1 1 1 1 1 1 1 1 1
symmnumber: 1
zpe: 1051286.5 jmol-1
zpe.correction: 0.400414 hartree
zpe.thermalcorrener: 0.422713 hartree
zpe.thermalcorrenthalpy: 0.423657 hartree
zpe.thermalcorrgfe: 0.347713 hartree
zpe.sumelectzpe: -974.436142 hartree
zpe.sumelectthermal: -974.413843 hartree
zpe.sumelectthermalent: -974.412899 hartree
zpe.sumelectthermalfe: -974.488842 hartree
dipole: -2.1391 -0.0741 2.2567
dipole: 3.1103
quadrupole: -179.4519 -140.1483 -148.2009
quadrupole: 4.7496 0.9944 -2.7052
quadrupole: -23.5182 15.7854 7.7328 4.7496 0.9944 -2.7052
hfenergy: -974.8365558 hartree
pointgroup: C01 [X(C19H25I1O3)]
dipole: 0.7706747 -0.0288257 0.9500883 debye
polarizability: 301.0298155|-24.2486214|225.947867|19.6041661|0.3711139|167.6712108 unknown
InChI: InChI=1S/C19H25IO3/c1-19-9-16(23-2)17-12-6-4-11(21)7-10(12)3-5-13(17)14(19)8-15(20)18(19)22/h4,6-7,13-18,21-22H,3,5,8-9H2,1-2H3
charge 0 multiplicity 1
48 atoms
I  -5.427309 2.410534 -1.194246
O  0.25754 -2.10351 0.760751
O  -4.906053 -1.273293 -0.180772
O  6.215945 0.1858 -0.040809
C  -2.444006 -0.574151 0.065254
C  -1.806134 0.841285 -0.091466
C  -0.329306 0.879209 0.337692
C  0.456305 -0.090336 -0.599184
C  -1.653337 -1.571112 -0.812525
C  -3.891336 -0.26051 -0.45017
C  -2.840443 1.792664 0.558001
C  -0.118403 -1.533766 -0.547862
C  -4.204956 1.137071 0.18606
C  0.30156 2.284297 0.266528
C  -2.51566 -1.071725 1.534129
C  1.976335 -0.012167 -0.392383
C  1.736097 2.246205 0.83013
C  2.574149 1.110825 0.246736
C  2.833178 -1.026635 -0.895248
C  3.984551 1.184417 0.367464
C  0.23205 -3.562999 0.794819
C  4.232562 -0.959636 -0.776902
C  4.810379 0.158059 -0.136098
H  -1.823794 1.065084 -1.184648
H  -0.232892 0.516592 1.381834
H  0.248091 0.259423 -1.637982
H  -1.809248 -1.319968 -1.882662
H  -2.031735 -2.602314 -0.675746
H  -3.879831 -0.194473 -1.551261
H  -2.727905 1.819072 1.659561
H  -2.755599 2.828097 0.194896
H  0.363198 -2.147339 -1.343466
H  -4.888603 1.041849 1.046493
H  -0.30371 3.009522 0.843169
H  0.313057 2.633094 -0.786917
H  -1.506925 -1.215044 1.949664
H  -3.075634 -0.380187 2.192093
H  -3.016223 -2.05873 1.569249
H  1.68122 2.119115 1.931956
H  2.246349 3.213194 0.655926
H  -5.029504 -1.356493 0.799333
H  2.402794 -1.902096 -1.39351
H  4.433153 2.059622 0.859589
H  0.88146 -3.993415 0.002823
H  -0.793745 -3.970634 0.677545
H  0.624498 -3.852036 1.78274
H  4.882114 -1.748477 -1.166918
H  6.518007 1.003516 0.42694
